3-Decyn-1-ol
- Formula: C10H18O
- Molecular weight: 154.2493
- IUPAC Standard InChIKey: YGEQBZUDPQQIFI-UHFFFAOYSA-N
- CAS Registry Number: 51721-39-2
- Chemical structure:
View 3d structure (requires JavaScript / HTML 5) - Permanent link for this species. Use this link for bookmarking this species for future reference.

Phase change data

Data compiled by: Robert L. Brown and Stephen E. Stein
Reduced pressure boiling point
Tboil (K) | Pressure (bar) | Reference |
---|---|---|
403. to 404. | 0.029 | Farchan Laboratories, 1990 |

References

Farchan Laboratories, 1990
Farchan Laboratories,
Research Chemicals Catalog, Farchan Laboratories, Gainesville, FL, 1990, 91. [all data]