1-Butene, 3-chloro-2-methyl-
- Formula: C5H9Cl
- Molecular weight: 104.578
- IUPAC Standard InChIKey: UCUDJURUNUQAHQ-UHFFFAOYSA-N
- CAS Registry Number: 5166-35-8
- Chemical structure:
View 3d structure (requires JavaScript / HTML 5) - Other names: 3-Chloro-2-methyl-1-butene

Reaction thermochemistry data

Data compiled by: Hussein Y. Afeefy, Joel F. Liebman, and Stephen E. Stein
Individual Reactions
By formula: C5H9Cl = C5H9Cl
Quantity | Value | Units | Method | Reference | Comment |
---|---|---|---|---|---|
ΔrH° | -2.0 ± 1.3 | kJ/mol | Eqk | Meged, Levanova, et al., 1978 | gas phase; UV Irradiation |

Normal alkane RI, non-polar column, isothermal

Column type | Active phase | Temperature (C) | I | Reference | Comment |
---|---|---|---|---|---|
Capillary | Squalane | 30. | 657. | Tourres, 1968 | Nitrogen; Column length: 50. m; Column diameter: 0.25 mm |
Capillary | Squalane | 50. | 660. | Tourres, 1968 | Nitrogen; Column length: 50. m; Column diameter: 0.25 mm |

Normal alkane RI, non-polar column, temperature ramp

Column type | Active phase | I | Reference | Comment |
---|---|---|---|---|
Capillary | OV-101 | 691. | Zenkevich, 2005 | 25. m/0.20 mm/0.10 μm, N2/He, 6. K/min; Tstart: 50. C; Tend: 250. C |
Capillary | OV-101 | 710. | Zenkevich, 2005 | 25. m/0.20 mm/0.10 μm, N2/He, 6. K/min; Tstart: 50. C; Tend: 250. C |

References

Meged, Levanova, et al., 1978
Meged, V.M.; Levanova, S.V.; Shevtsova, L.A.; Rozhnov, A.M.; Kudryavtseva, T.A.,
The allyl rearrangement of chloromethylbutenes,
Russ. J. Phys. Chem. (Engl. Transl.), 1978, 52, 286. [all data]
Tourres, 1968
Tourres, D.A.,
Separation of mono- and dichloro-methyl butanes and of monochloro-methyl butenes by preparative gas chromatography,
Chromatographia, 1968, 1, 11-12, 437-442, https://doi.org/10.1007/BF02255759
. [all data]
Zenkevich, 2005
Zenkevich, I.G.,
Experimentally measured retention indices., 2005. [all data]