5-Decen-1-ol, (Z)-
- Formula: C10H20O
- Molecular weight: 156.2652
- IUPAC Standard InChIKey: WYPQHXVMNVEVEB-WAYWQWQTSA-N
- CAS Registry Number: 51652-47-2
- Chemical structure:
View 3d structure (requires JavaScript / HTML 5) - Stereoisomers:
- Other names: Z-5-Decen-1-ol

Normal alkane RI, non-polar column, temperature ramp

Column type | Active phase | I | Reference | Comment |
---|---|---|---|---|
Capillary | OV-101 | 1247. | Tamura, Kihara, et al., 1990 | Nitrogen, 2. K/min; Column length: 50. m; Column diameter: 0.25 mm; Tstart: 80. C; Tend: 200. C |

Normal alkane RI, polar column, temperature ramp

Column type | Active phase | I | Reference | Comment |
---|---|---|---|---|
Capillary | Carbowax 20M | 1810. | Tamura, Kihara, et al., 1990 | Nitrogen, 2. K/min; Column length: 50. m; Column diameter: 0.25 mm; Tstart: 80. C; Tend: 180. C |

Phase change data

Data compiled by: William E. Acree, Jr., James S. Chickos

Quantity Value Units Method Reference Comment
Δvap80.3kJ/molCGCOva, Koultek, et al., 2000Based on data from 323. - 363. K. See also Koutek, Hoskovec, et al., 1994.

References

Tamura, Kihara, et al., 1990
Tamura, H.; Kihara, S.; Sugisawa, H.,
A New Identification Method for Aliphatic Compounds Using Linear Equation of the GC Retention Index Value,
Agric. Biol. Chem., 1990, 54, 12, 3171-3176, https://doi.org/10.1271/bbb1961.54.3171
. [all data]