Carbazole, 1,5-dimethyl-
- Formula: C14H13N
- Molecular weight: 195.2597
- IUPAC Standard InChIKey: DEQROWVQAJBTMI-UHFFFAOYSA-N
- CAS Registry Number: 51640-60-9
- Chemical structure:
View 3d structure (requires JavaScript / HTML 5) - Permanent link for this species. Use this link for bookmarking this species for future reference.

Normal alkane RI, non-polar column, temperature ramp

Column type | Active phase | I | Reference | Comment |
---|---|---|---|---|
Capillary | DB-Petro | 2126. | Lu, Wu, et al., 2004 | 50. m/0.20 mm/0.50 μm, He, 35. C @ 5. min, 2. K/min, 300. C @ 5. min |

References

Lu, Wu, et al., 2004
Lu, X.; Wu, J.; Wu, J.; Kong, H.; Hua, R.; Tao, W.; Gu, J.; Xu, G.,
Characterization and quantitative determination of diesel fractions by comprehensive two-dimensional gas chromatography/time of flight mass spectrometry,
Chin. J. Chromatogr., 2004, 22, 1, 5-11. [all data]