Tungsten monofluoride

Gas phase thermochemistry data

Quantity Value Units Method Reference Comment
Δfgas386.18kJ/molReviewChase, 1998Data last reviewed in March, 1967
Quantity Value Units Method Reference Comment
gas,1 bar251.14J/mol*KReviewChase, 1998Data last reviewed in March, 1967

Gas Phase Heat Capacity (Shomate Equation)

Cp° = A + B*t + C*t2 + D*t3 + E/t2
H° − H°298.15= A*t + B*t2/2 + C*t3/3 + D*t4/4 − E/t + F − H
S° = A*ln(t) + B*t + C*t2/2 + D*t3/3 − E/(2*t2) + G
    Cp = heat capacity (J/mol*K)
    H° = standard enthalpy (kJ/mol)
    S° = standard entropy (J/mol*K)
    t = temperature (K) / 1000.

View plot Requires a JavaScript / HTML 5 canvas capable browser.

View table.

Temperature (K) 298. - 900.900. - 6000.
A 15.4697545.27841
B 84.60885-4.126721
C -91.062670.892736
D 32.93005-0.062267
E 0.048851-0.155170
F 378.7135370.6719
G 248.6656302.3279
H 386.1836386.1836
ReferenceChase, 1998Chase, 1998
Comment Data last reviewed in March, 1967 Data last reviewed in March, 1967

References

Chase, 1998
Chase, M.W., Jr., NIST-JANAF Themochemical Tables, Fourth Edition, J. Phys. Chem. Ref. Data, Monograph 9, 1998, 1-1951. [all data]