Benzene, 1-methyl-4-(2-methylpropyl)-
- Formula: C11H16
- Molecular weight: 148.2447
- IUPAC Standard InChIKey: VCGBZXLLPCGFQM-UHFFFAOYSA-N
- CAS Registry Number: 5161-04-6
- Chemical structure:
View 3d structure (requires JavaScript / HTML 5) - Other names: Toluene, p-isobutyl-

Phase change data

Data compiled by: Thermodynamics Research Center, NIST Boulder Laboratories, Chris Muzny director
Quantity | Value | Units | Method | Reference | Comment |
---|---|---|---|---|---|
Tboil | 470. | K | N/A | Wallach, 1915 | Uncertainty assigned by TRC = 6. K |

References

Wallach, 1915
Wallach, O.,
Nachr. Ges. Wiss. Goettingen, Math.-Phys. Kl., 1915, 1915, 1. [all data]