Oxirane, (chloromethyl)-, (R)-
- Formula: C3H5ClO
- Molecular weight: 92.524
- IUPAC Standard InChIKey: BRLQWZUYTZBJKN-GSVOUGTGSA-N
- CAS Registry Number: 51594-55-9
- Chemical structure:
View 3d structure (requires JavaScript / HTML 5) - Stereoisomers:
- Other names: (R)-(-)-Epichlorohydrin

Phase change data

Data compiled by: Robert L. Brown and Stephen E. Stein
Reduced pressure boiling point
Tboil (K) | Pressure (bar) | Reference |
---|---|---|
365.7 | 0.480 | Weast and Grasselli, 1989 |

References

Weast and Grasselli, 1989
CRC Handbook of Data on Organic Compounds, 2nd Editon, Weast,R.C and Grasselli, J.G., ed(s)., CRC Press, Inc., Boca Raton, FL, 1989, 1. [all data]