Acetic acid, trichloro-, ethyl ester
- Formula: C4H5Cl3O2
- Molecular weight: 191.440
- IUPAC Standard InChIKey: SJMLNDPIJZBEKY-UHFFFAOYSA-N
- CAS Registry Number: 515-84-4
- Chemical structure:
View 3d structure (requires JavaScript / HTML 5) - Other names: Ethyl trichloroacetate; Acetic acid, ester with trichloroethanol; Acetic acid, 2,2,2-trichloroethyl ester; Trichloroethyl acetate

Condensed phase thermochemistry data

Data compiled as indicated in comments:
ALS - Hussein Y. Afeefy, Joel F. Liebman, and Stephen E. Stein
DH - Eugene S. Domalski and Elizabeth D. Hearing
Quantity | Value | Units | Method | Reference | Comment |
---|---|---|---|---|---|
ΔcH°liquid | -1879. ± 8. | kJ/mol | Ccb | Smith, Bjellerup, et al., 1953 | At 291.7 °K; ALS |
ΔcH°liquid | -1872. | kJ/mol | Ccb | Schjanberg, 1935 | ALS |
Constant pressure heat capacity of liquid
Cp,liquid (J/mol*K) | Temperature (K) | Reference | Comment |
---|---|---|---|
230.1 | 298. | von Reis, 1881 | T = 289 to 457 K.; DH |

Phase change data

Data compiled as indicated in comments:
BS - Robert L. Brown and Stephen E. Stein
ALS - Hussein Y. Afeefy, Joel F. Liebman, and Stephen E. Stein
AC - William E. Acree, Jr., James S. Chickos
Quantity | Value | Units | Method | Reference | Comment |
---|---|---|---|---|---|
Tboil | 440.7 | K | N/A | Weast and Grasselli, 1989 | BS |
Quantity | Value | Units | Method | Reference | Comment |
ΔvapH° | 50.97 ± 0.12 | kJ/mol | C | Laynez and Wadso, 1972 | ALS |
ΔvapH° | 51.0 ± 0.1 | kJ/mol | C | Laynez, Wadsö, et al., 1972 | AC |
Enthalpy of vaporization
ΔvapH (kJ/mol) | Temperature (K) | Method | Reference | Comment |
---|---|---|---|---|
49. | 308. | A | Stephenson and Malanowski, 1987 | Based on data from 293. to 440. K.; AC |
47.5 | 332. | N/A | Usanovich and Dembitskii, 1959 | Based on data from 317. to 368. K. See also Boublik, Fried, et al., 1984.; AC |
Antoine Equation Parameters
log10(P) = A − (B / (T + C))
P = vapor pressure (bar)
T = temperature (K)
View plot Requires a JavaScript / HTML 5 canvas capable browser.
Temperature (K) | A | B | C | Reference | Comment |
---|---|---|---|---|---|
317.4 to 368.3 | 5.93031 | 2691.087 | 19.39 | Usanovich and Dembitskii, 1959, 2 | Coefficents calculated by NIST from author's data. |

Gas phase ion energetics data

Data evaluated by: Edward P. Hunter and Sharon G. Lias
Quantity | Value | Units | Method | Reference | Comment |
---|---|---|---|---|---|
Proton affinity (review) | 790.4 | kJ/mol | N/A | Hunter and Lias, 1998 | |
Quantity | Value | Units | Method | Reference | Comment |
Gas basicity | 759.4 | kJ/mol | N/A | Hunter and Lias, 1998 |

Kovats' RI, non-polar column, isothermal

Column type | Active phase | Temperature (C) | I | Reference | Comment |
---|---|---|---|---|---|
Capillary | SE-30 | 100. | 944. | Haken and Korhonen, 1986 | N2; Column length: 25. m; Column diameter: 0.33 mm |
Capillary | SE-30 | 120. | 930. | Haken and Korhonen, 1986 | N2; Column length: 25. m; Column diameter: 0.33 mm |
Capillary | SE-30 | 140. | 949. | Haken and Korhonen, 1986 | N2; Column length: 25. m; Column diameter: 0.33 mm |
Capillary | SE-30 | 80. | 955. | Haken and Korhonen, 1986 | N2; Column length: 25. m; Column diameter: 0.33 mm |
Packed | SE-30 | 150. | 975. | Tiess, 1984 | Ar, Gas Chrom Q (80-100 mesh); Column length: 3. m |
Capillary | SE-30 | 100. | 981. | Haken, Madden, et al., 1983 | Column length: 25. m; Column diameter: 0.22 mm |
Capillary | SE-30 | 140. | 966. | Haken, Madden, et al., 1983 | Column length: 25. m; Column diameter: 0.22 mm |
Capillary | SE-30 | 180. | 965. | Haken, Madden, et al., 1983 | Column length: 25. m; Column diameter: 0.22 mm |
Capillary | OV-101 | 80. | 961.7 | Komárek, Hornová, et al., 1982 | N2; Column length: 15. m; Column diameter: 0.22 mm |
Packed | SE-30 | 200. | 990. | Golovkin, Smol'chenko, et al., 1980 | N2, Chromaton N-AW-DMCS; Column length: 1. m |

Kovats' RI, polar column, isothermal

Column type | Active phase | Temperature (C) | I | Reference | Comment |
---|---|---|---|---|---|
Capillary | OV-351 | 120. | 1400. | Haken and Korhonen, 1986 | N2; Column length: 25. m; Column diameter: 0.32 mm |
Capillary | OV-351 | 140. | 1390. | Haken and Korhonen, 1986 | N2; Column length: 25. m; Column diameter: 0.32 mm |
Capillary | OV-351 | 160. | 1396. | Haken and Korhonen, 1986 | N2; Column length: 25. m; Column diameter: 0.32 mm |
Capillary | OV-351 | 180. | 1392. | Haken and Korhonen, 1986 | N2; Column length: 25. m; Column diameter: 0.32 mm |
Capillary | OV-351 | 200. | 1443. | Haken and Korhonen, 1986 | N2; Column length: 25. m; Column diameter: 0.32 mm |

Normal alkane RI, non-polar column, custom temperature program

Column type | Active phase | I | Reference | Comment |
---|---|---|---|---|
Capillary | Polydimethyl siloxanes | 959. | Zenkevich, Eliseenkov, et al., 2006 | Program: not specified |

References

Smith, Bjellerup, et al., 1953
Smith, L.; Bjellerup, L.; Krook, S.; Westermark, H.,
Heats of combustion of organic chloro compounds determined by the "quartz wool" method,
Acta Chem. Scand., 1953, 7, 65. [all data]
Schjanberg, 1935
Schjanberg, E.,
Die Verbrennungswarmen und die Refraktionsdaten einiger chlorsubstituierter Fettsauren und Ester.,
Z. Phys. Chem. Abt. A, 1935, 172, 197-233. [all data]
von Reis, 1881
von Reis, M.A.,
Die specifische Wärme flüssiger organischer Verbindungen und ihre Beziehung zu deren Moleculargewicht,
Ann. Physik [3], 1881, 13, 447-464. [all data]
Weast and Grasselli, 1989
CRC Handbook of Data on Organic Compounds, 2nd Editon, Weast,R.C and Grasselli, J.G., ed(s)., CRC Press, Inc., Boca Raton, FL, 1989, 1. [all data]
Laynez and Wadso, 1972
Laynez, J.; Wadso, I.,
Enthalpies of vaporization of organic compounds. IX. Some halogen substituted hydrocarbons and esters,
Acta Chem. Scand., 1972, 26, 3148. [all data]
Laynez, Wadsö, et al., 1972
Laynez, José; Wadsö, Ingemar; Haug, Arne; Songstad, J.; Pilotti, Åke,
Enthalpies of Vaporization of Organic Compounds. IX. Some Halogen Substituted Hydrocarbons and Esters.,
Acta Chem. Scand., 1972, 26, 3148-3152, https://doi.org/10.3891/acta.chem.scand.26-3148
. [all data]
Stephenson and Malanowski, 1987
Stephenson, Richard M.; Malanowski, Stanislaw,
Handbook of the Thermodynamics of Organic Compounds, 1987, https://doi.org/10.1007/978-94-009-3173-2
. [all data]
Usanovich and Dembitskii, 1959
Usanovich, M.; Dembitskii, A.I.,
Zh. Obshch. Khim., 1959, 29, 1781. [all data]
Boublik, Fried, et al., 1984
Boublik, T.; Fried, V.; Hala, E.,
The Vapour Pressures of Pure Substances: Selected Values of the Temperature Dependence of the Vapour Pressures of Some Pure Substances in the Normal and Low Pressure Region, 2nd ed., Elsevier, New York, 1984, 972. [all data]
Usanovich and Dembitskii, 1959, 2
Usanovich, M.; Dembitskii, A.,
Vapor Pressure of the SnCl4 -- CCl3COOC2H5 and SnCl4 -- C6H5OCH3 Systems,
J. Gen. Chem. USSR (Engl. Transl.), 1959, 1754-1757. [all data]
Hunter and Lias, 1998
Hunter, E.P.; Lias, S.G.,
Evaluated Gas Phase Basicities and Proton Affinities of Molecules: An Update,
J. Phys. Chem. Ref. Data, 1998, 27, 3, 413-656, https://doi.org/10.1063/1.556018
. [all data]
Haken and Korhonen, 1986
Haken, J.R.; Korhonen, I.O.O.,
Gas chromatography of homologous esters. XXXIII. Capillary chromatography of monochlorinated C1-C8 n-alkyl acetates, chloracetates, dichloroacetates and trichloroacetates,
J. Chromatogr., 1986, 357, 253-271, https://doi.org/10.1016/S0021-9673(01)95828-5
. [all data]
Tiess, 1984
Tiess, D.,
Gaschromatographische Retentionsindices von 125 leicht- bis mittelflüchtigen organischen Substanzen toxikologisch-analytischer Relevanz auf SE-30,
Wiss. Z. Wilhelm-Pieck-Univ. Rostock Math. Naturwiss. Reihe, 1984, 33, 6-9. [all data]
Haken, Madden, et al., 1983
Haken, J.K.; Madden, B.G.; Korhonen, I.O.O.,
Gas chromatography of homologous esters. XX. Capillary column studies of alkyl acetates, chloroacetates, dichloroacetates and trichloroacetates,
J. Chromatogr., 1983, 256, 221-229, https://doi.org/10.1016/S0021-9673(01)88235-2
. [all data]
Komárek, Hornová, et al., 1982
Komárek, K.; Hornová, L.; Churácek, J.,
Glass capillary gas chromatography of homologous series of esters. Separation of homologous series of esters of halogenated carboxylic acids on a glass capillary column with the non-polar stationary silicone phase OV-101,
J. Chromatogr., 1982, 244, 1, 142-147, https://doi.org/10.1016/S0021-9673(00)80131-4
. [all data]
Golovkin, Smol'chenko, et al., 1980
Golovkin, G.V.; Smol'chenko, A.I.; Zotov, L.N.; Sazonov, S.E.,
Systems of gas-chromatographic retention indices for identifying pesticides by means of selective detectors,
Zh. Anal. Khim., 1980, 35, 5, 651-655. [all data]
Zenkevich, Eliseenkov, et al., 2006
Zenkevich, I.G.; Eliseenkov, E.V.; Kasatochkin, A.N.,
Application of Retention Indices in GC-MS Identification of Halogenated Organic Compounds,
Mass Spectromery (Rus.), 2006, 3, 2, 131-140. [all data]