2,2,2-Trichloro-1-ethoxy ethanol
- Formula: C4H7Cl3O2
- Molecular weight: 193.456
- IUPAC Standard InChIKey: DLHWKJDYXPNWAI-UHFFFAOYSA-N
- CAS Registry Number: 515-83-3
- Chemical structure:
View 3d structure (requires JavaScript / HTML 5) - Other names: Ethanol, 2,2,2-trichloro-1-ethoxy-

Phase change data

Data compiled by: Thermodynamics Research Center, NIST Boulder Laboratories, Chris Muzny director
Quantity | Value | Units | Method | Reference | Comment |
---|---|---|---|---|---|
Tfus | 300. | K | N/A | Berthelot, 1882 | Uncertainty assigned by TRC = 1. K |

Reaction thermochemistry data

Data compiled by: Hussein Y. Afeefy, Joel F. Liebman, and Stephen E. Stein
Individual Reactions
By formula: C2H6O + C2HCl3O = C4H7Cl3O2
Quantity | Value | Units | Method | Reference | Comment |
---|---|---|---|---|---|
ΔrH° | -47.3 | kJ/mol | Eqk | Jensen and Pedersen, 1971 | liquid phase; solvent: Heptane |

References

Berthelot, 1882
Berthelot, M.,
Ann. Chim. Phys., 1882, 27, 389. [all data]
Jensen and Pedersen, 1971
Jensen, R.B.; Pedersen, S.B.,
Reaction between chloral and alcohols. 9. Dissociation of chloral hemiacetals of some aliphatic primary and secondary alcohols,
Acta Chem. Scand., 1971, 25, 2911-2930. [all data]