Butanal, ethylhydrazone
- Formula: C6H14N2
- Molecular weight: 114.1888
- IUPAC Standard InChIKey: YICJUYKPMNNKIA-UHFFFAOYSA-N
- CAS Registry Number: 51576-30-8
- Chemical structure:
View 3d structure (requires JavaScript / HTML 5) - Other names: Butyraldehyde ethylhydrazone

Normal alkane RI, non-polar column, temperature ramp

Column type | Active phase | I | Reference | Comment |
---|---|---|---|---|
Capillary | OV-101 | 910. | Zenkevich, 2005 | 25. m/0.20 mm/0.10 μm, N2/He, 6. K/min; Tstart: 50. C; Tend: 250. C |

References

Zenkevich, 2005
Zenkevich, I.G.,
Experimentally measured retention indices., 2005. [all data]