C2H5C(CH3)2ONO
- Formula: C5H11NO2
- Molecular weight: 117.1463
- IUPAC Standard InChIKey: JXCNBASKFCBVAN-UHFFFAOYSA-N
- CAS Registry Number: 5156-41-2
- Chemical structure:
View 3d structure (requires JavaScript / HTML 5) - Other names: tert.-Pentyl nitrite

Gas phase thermochemistry data

Data compiled by: Hussein Y. Afeefy, Joel F. Liebman, and Stephen E. Stein
Quantity | Value | Units | Method | Reference | Comment |
---|---|---|---|---|---|
ΔfH°gas | -192. ± 3. | kJ/mol | Ccb | Islam, 1979 | Heat of combustion is not reported |

Condensed phase thermochemistry data

Data compiled by: Hussein Y. Afeefy, Joel F. Liebman, and Stephen E. Stein
Quantity | Value | Units | Method | Reference | Comment |
---|---|---|---|---|---|
ΔfH°liquid | -251. | kJ/mol | Ccb | Islam, 1979 | Heat of combustion is not reported |

Phase change data

Data compiled by: Hussein Y. Afeefy, Joel F. Liebman, and Stephen E. Stein
Quantity | Value | Units | Method | Reference | Comment |
---|---|---|---|---|---|
ΔvapH° | 59.8 | kJ/mol | E | Islam, 1979 | Heat of combustion is not reported |

Normal alkane RI, non-polar column, temperature ramp

Column type | Active phase | I | Reference | Comment |
---|---|---|---|---|
Capillary | OV-101 | 621. | Zenkevich, 2005 | 25. m/0.20 mm/0.10 μm, N2/He, 6. K/min; Tstart: 50. C; Tend: 250. C |

Normal alkane RI, polar column, custom temperature program

Column type | Active phase | I | Reference | Comment |
---|---|---|---|---|
Packed | Carbowax 6M | 815. | Zenkevich and Malamakhov, 1984 | Nitrogen, Chromaton N AW (0.25-0.315 mm); Column length: 2. m; Program: not specified |

References

Islam, 1979
Islam, T.S.A.,
Heat of formation of tert-amyl nitrite and the tert amyloxyl-nitrite bond dissociation energy,
J. Bangladesh Acad. Sci., 1979, 3, 93-95. [all data]
Zenkevich, 2005
Zenkevich, I.G.,
Experimentally measured retention indices., 2005. [all data]
Zenkevich and Malamakhov, 1984
Zenkevich, I.G.; Malamakhov, A.S.,
Group Chromato Mass Spectrometric Identification of Alkylnitrites,
Zh. Anal. Khim. (Rus), 1984, 39, 10, 1864-1868. [all data]