p-Bromophenyloctane
- Formula: C14H21Br
- Molecular weight: 269.221
- IUPAC Standard InChIKey: OOZQSVXPBCINJF-UHFFFAOYSA-N
- CAS Registry Number: 51554-93-9
- Chemical structure:
View 3d structure (requires JavaScript / HTML 5) - Other names: p-Octylbromobenzene

Phase change data

Data compiled by: Robert L. Brown and Stephen E. Stein
Reduced pressure boiling point
Tboil (K) | Pressure (bar) | Reference |
---|---|---|
398. to 401. | 0.001 | Frinton Laboratories Inc., 1986 |

References

Frinton Laboratories Inc., 1986
Frinton Laboratories Inc.,
Catalog Number 11, Frinton Laboratories Inc., Vineland, NJ, 1986, 99. [all data]