Naphthalene, decahydro-4a-methyl-1-methylene-7-(1-methylethylidene)-, (4aR-trans)-
- Formula: C15H24
- Molecular weight: 204.3511
- IUPAC Standard InChIKey: RMZHSBMIZBMVMN-LOACHALJSA-N
- CAS Registry Number: 515-17-3
- Chemical structure:
View 3d structure (requires JavaScript / HTML 5) - Stereoisomers:
- Other names: Eudesma-4(14),7(11)-diene; γ-Selinene; Selina-4(14),7(11)-diene; (4α-trans)-Decahydro-4α-methyl-1-methylene-7-(1-methylethylidene)-naphthalene; Eudesma-4(15),7(11)-diene; Selina-4(15),7(11)-diene

Kovats' RI, non-polar column, temperature ramp

Column type | Active phase | I | Reference | Comment |
---|---|---|---|---|
Capillary | BP-1 | 1497. | Raina, Srivastava, et al., 2002 | 25. m/0.32 mm/0.25 μm, N2, 5. K/min, 220. C @ 15. min; Tstart: 60. C |
Capillary | HP-5MS | 1470. | Roussis, Tsoukatou, et al., 2000 | 30. m/0.25 mm/0.25 μm, He, 3. K/min; Tstart: 60. C; Tend: 280. C |
Capillary | HP-5MS | 1532. | Siani, Ramos, et al., 1999 | 30. m/0.32 mm/0.25 μm, He, 70. C @ 5. min, 3. K/min; Tend: 250. C |

Kovats' RI, polar column, temperature ramp

Column type | Active phase | I | Reference | Comment |
---|---|---|---|---|
Capillary | Carbowax 20M | 1671. | Randriamiharisoa and Gaydou, 1987 | He, 2. K/min; Column length: 50. m; Column diameter: 0.3 mm; Tstart: 70. C; Tend: 210. C |

Van Den Dool and Kratz RI, non-polar column, temperature ramp

Column type | Active phase | I | Reference | Comment |
---|---|---|---|---|
Capillary | HP-5MS | 1532. | Vagionas, Ngassapa, et al., 2007 | 30. m/0.25 mm/0.25 μm, He, 3. K/min; Tstart: 60. C; Tend: 280. C |
Capillary | BP-1 | 1531. | Duquesnoy, Dinh, et al., 2006 | 50. m/0.22 mm/0.25 μm, He, 2. K/min, 220. C @ 20. min; Tstart: 60. C |
Capillary | BP-1 | 1531. | Gonny, Cavaleiro, et al., 2006 | 50. m/0.22 mm/0.25 μm, He, 2. K/min, 220. C @ 20. min; Tstart: 60. C |
Capillary | HP-5MS | 1469. | Skaltsa, Mavrommati, et al., 2001 | 30. m/0.25 mm/0.25 μm, He, 60. C @ 5. min, 4. K/min; Tend: 280. C |
Capillary | DB-1 | 1438. | Adedeji, Hartman, et al., 1991 | 60. m/0.25 mm/0.25 μm, He, 40. C @ 3. min, 2. K/min, 280. C @ 10. min |

Van Den Dool and Kratz RI, non-polar column, custom temperature program

Column type | Active phase | I | Reference | Comment |
---|---|---|---|---|
Capillary | BPX-5 | 1481. | Dharmawan, Kasapis, et al., 2007 | 30. m/0.25 mm/0.25 μm, He; Program: 35C => 4C/min => 200C => 30C/min => 300C (3min) |
Capillary | DB-1 | 1512. | Eri, Khoo, et al., 2000 | 60. m/0.25 mm/0.25 μm, He; Program: -20C (5min) => 10C/min => 100C => 4C/min => 200C => 10C/min => 280C |

Van Den Dool and Kratz RI, polar column, temperature ramp

Column type | Active phase | I | Reference | Comment |
---|---|---|---|---|
Capillary | DB-Wax | 1676. | Osorio, Alarcon, et al., 2006 | 30. m/0.25 mm/0.25 μm, He, 50. C @ 4. min, 4. K/min, 220. C @ 20. min |
Capillary | DB-Wax | 1672. | Gancel, Ollitrault, et al., 2005 | 30. m/0.25 mm/0.25 μm, He, 3. K/min, 250. C @ 20. min; Tstart: 40. C |
Capillary | DB-Wax | 1672. | Gancel, Ollitrault, et al., 2003 | 60. m/0.32 mm/0.25 μm, H2, 1.5 K/min, 245. C @ 20. min; Tstart: 40. C |

Normal alkane RI, non-polar column, temperature ramp

Column type | Active phase | I | Reference | Comment |
---|---|---|---|---|
Capillary | HP-1 | 1435. | Wetwiayaklung, Thavanapong, et al., 2009 | 25. m/0.32 mm/0.17 μm, 50. C @ 5. min, 1. K/min, 260. C @ 5. min |
Capillary | HP-5 MS | 1479. | Zhao, Zeng, et al., 2009 | 30. m/0.25 mm/0.25 μm, Helium, 4. K/min; Tstart: 50. C; Tend: 280. C |
Capillary | HP-1 | 1472. | Hachicha, Skanji, et al., 2007 | 30. m/0.25 mm/0.25 μm, He, 2. K/min, 240. C @ 20. min; Tstart: 60. C |
Capillary | HP-5MS | 1473. | Ghasemi Y., Faridi P., et al., 2005 | He, 50. C @ 3. min, 3. K/min, 250. C @ 10. min; Column length: 25. m; Column diameter: 0.25 mm |
Capillary | DB-5 | 1522. | Morteza-Semnani and Saeedi, 2005 | 30. m/0.25 mm/0.25 μm, He, 60. C @ 4. min, 4. K/min; Tend: 220. C |
Capillary | HP-5 | 1473. | Simic, Sokovic, et al., 2004 | 25. m/0.32 mm/0.52 μm, H2, 4. K/min; Tstart: 40. C; Tend: 240. C |
Capillary | OV-101 | 1517. | Orav, Kailas, et al., 2003 | 50. m/0.2 mm/0.5 μm, He, 2. K/min; Tstart: 50. C; Tend: 250. C |
Capillary | HP-5 | 1483. | Yassa, Akhani, et al., 2003 | 30. m/0.25 mm/0.32 μm, He, 60. C @ 30. min, 5. K/min; Tend: 250. C |
Capillary | DB-5 | 1484. | Everaerts, Roisin, et al., 1993 | Helium, 3. K/min; Column length: 60. m; Column diameter: 0.32 mm; Tstart: 60. C; Tend: 220. C |

Normal alkane RI, non-polar column, custom temperature program

Column type | Active phase | I | Reference | Comment |
---|---|---|---|---|
Capillary | DB-5 | 1530. | Miyazaki, Plotto, et al., 2011 | 60. m/0.25 mm/1.00 μm, Helium; Program: 40 0C 4 0C/min -> 230 0C 100 0C/min -> 260 0C (11.7 min) |
Capillary | HP-5 MS | 1509. | Wang, Xu, et al., 2011 | 30. m/0.25 mm/0.25 μm, Helium; Program: 50 0C (1.5 min) 10 0C/min -> 180 0C (2 min) 6 0C/min -> 280 0C (10 min) |
Capillary | DB-5 | 1479. | Courtois, Paine, et al., 2009 | 30. m/0.25 mm/0.25 μm, Helium; Program: 50 0C m6 0C/min -> 140 0C 5 0C/min -> 160 0C (1 min) 10 0C/min -> 200 0C |
Capillary | HP-1 | 1438. | Wetwiayaklung, Thavanapong, et al., 2009 | 25. m/0.32 mm/0.17 μm; Program: not specified |
Capillary | CP-Sil | 1468. | Proffit, 2007 | 30. m/0.25 mm/0.25 μm, Helium; Program: 50 0C (3 min) 3 0C/min -> 100 0C 2.7 0C/min -> 140 0C 2.4 0C/min -> 180 0C 6 0C/min -> 250 0C |
Capillary | CP-Sil | 1487. | Proffit, 2007 | 30. m/0.25 mm/0.25 μm, Helium; Program: 50 0C (3 min) 3 0C/min -> 100 0C 2.7 0C/min -> 140 0C 2.4 0C/min -> 180 0C 6 0C/min -> 250 0C |
Capillary | HP-5 MS | 1474. | Setzer, Stokes, et al., 2007 | Helium; Column length: 30. m; Column diameter: 0.25 mm; Program: 40 0C (10 min) 3 oC/min -> 200 0C 2 0C/min -> 220 0C |
Capillary | HP-5MS | 1477. | Takaku, Haber, et al., 2007 | He; Column length: 30. m; Column diameter: 0.25 mm; Program: 40C(10min) => 3C/min => 200C => 2C/min => 220C |
Capillary | DB-5 | 1522. | Letchamo, Ward, et al., 2004 | 30. m/0.25 mm/0.25 μm, He; Program: 60C(4min) => 6C/min => 240 => 10C/min => 280C |
Capillary | CP Sil 5 CB | 1532. | Weyerstahl, Marschall, et al., 2000 | Column length: 25. m; Program: not specified |

Normal alkane RI, polar column, temperature ramp

Column type | Active phase | I | Reference | Comment |
---|---|---|---|---|
Capillary | HP-Innowax | 1697. | Hachicha, Skanji, et al., 2007 | 30. m/0.25 mm/0.25 μm, He, 2. K/min, 240. C @ 20. min; Tstart: 60. C |
Capillary | CP-Wax 52CB | 1685. | Hymete, Rohloff, et al., 2007 | 30. m/0.32 mm/0.25 μm, He, 40. C @ 1. min, 3. K/min, 220. C @ 2. min |
Capillary | DB-Wax | 1682. | Everaerts, Roisin, et al., 1993 | Helium, 3. K/min; Column length: 60. m; Column diameter: 0.32 mm; Tstart: 60. C; Tend: 220. C |

Normal alkane RI, polar column, custom temperature program

Column type | Active phase | I | Reference | Comment |
---|---|---|---|---|
Capillary | Carbowax 20M | 1671. | Vinogradov, 2004 | Program: not specified |
Capillary | HP-Innowax | 1690. | Baser, Demirci, et al., 2001 | 60. m/0.25 mm/0.25 μm, He; Program: 60 0C (10 min) 10 K/min -> 220 0C (10 min) 1K/min -> 240 0C |
Capillary | HP-Innowax | 1690. | Gören, Demirci, et al., 2001 | 60. m/0.25 mm/0.25 μm, He; Program: 60 0C (10 min) 4 K/min -> 220 0C (10 min) 1 K/min -> 240 0C |
Capillary | HP-Innowax | 1690. | Tabanca, Kirimer, et al., 2001 | 60. m/0.25 mm/0.25 μm, He; Program: 60C(10min) => 4C/min => 220C(10min) => 1C/min => 240C |

References

Raina, Srivastava, et al., 2002
Raina, V.K.; Srivastava, S.K.; Syamasunder, K.V.,
The essential oil of 'greater galangal' [Alpinia galanga (L.) Willd.] from the lower Himalayan region of India,
Flavour Fragr. J., 2002, 17, 5, 358-360, https://doi.org/10.1002/ffj.1105
. [all data]
Roussis, Tsoukatou, et al., 2000
Roussis, V.; Tsoukatou, M.; Petrakis, P.V.; Chinou, I.; Skoula, M.; Harborne, J.B.,
Volatile constituents of four Helichrysum species growing in Greece,
Biochem. Syst. Ecol., 2000, 28, 2, 163-175, https://doi.org/10.1016/S0305-1978(99)00046-0
. [all data]
Siani, Ramos, et al., 1999
Siani, A.C.; Ramos, M.F.S.; Menezes-de-Lima, O., Jr.; Ribeiro-dos-Santos, R.; Fernadez-Ferreira, E.; Soares, R.O.A.; Rosas, E.C.; Susunaga, G.S.; Guimarães, A.C.; Zoghbi, M.G.B.; Henriques, M.G.M.O.,
Evaluation of anti-inflammatory-related activity of essential oils from the leaves and resin of species of Protium,
J. Ethnopharmacol., 1999, 66, 1, 57-69, https://doi.org/10.1016/S0378-8741(98)00148-2
. [all data]
Randriamiharisoa and Gaydou, 1987
Randriamiharisoa, R.P.; Gaydou, E.M.,
Composition of Palmarosa (Cymbopogon martinii) essential oil from Madagascar,
J. Agric. Food Chem., 1987, 35, 1, 62-66, https://doi.org/10.1021/jf00073a015
. [all data]
Vagionas, Ngassapa, et al., 2007
Vagionas, K.; Ngassapa, O.; Runyoro, D.; Graikou, K.; Gortzi, O.; Chinou, I.,
Chemical analysis of edible aromatic plants growing in Tanzania,
Food Chem., 2007, 105, 4, 1711-1717, https://doi.org/10.1016/j.foodchem.2007.05.029
. [all data]
Duquesnoy, Dinh, et al., 2006
Duquesnoy, E.; Dinh, N.H.; Castola, V.; Casanova, J.,
Composition of a Pyrolytic oil from Cupressus funebris Endl. of Vietnamese origin,
Flavour Fragr. J., 2006, 21, 3, 453-457, https://doi.org/10.1002/ffj.1676
. [all data]
Gonny, Cavaleiro, et al., 2006
Gonny, M.; Cavaleiro, C.; Salgueiro, L.; Casanova, J.,
Analysis of Juniperus communis subsp. alpina needle, berry, wood and root oils by combination of GC, GC/MS and 13C-NMR,
Flavour Fragr. J., 2006, 21, 1, 99-106, https://doi.org/10.1002/ffj.1527
. [all data]
Skaltsa, Mavrommati, et al., 2001
Skaltsa, H.D.; Mavrommati, A.; Constantinidis, T.,
A chemotaxonomic investigation of volatile constituents in Stachys subsect. Swainsonianeae (Labiatae),
Phytochemistry, 2001, 57, 2, 235-244, https://doi.org/10.1016/S0031-9422(01)00003-6
. [all data]
Adedeji, Hartman, et al., 1991
Adedeji, J.; Hartman, T.G.; Rosen, R.T.; Ho, C.-T.,
Free and glycosidically bound aroma compounds in hog plum (Spondias mombins L.),
J. Agric. Food Chem., 1991, 39, 8, 1494-1497, https://doi.org/10.1021/jf00008a025
. [all data]
Dharmawan, Kasapis, et al., 2007
Dharmawan, J.; Kasapis, S.; Curran, P.; Johnson, J.R.,
Characterization of volatile compounds in selected citrus fruits from Asia. Part I: freshly-squeezed juice,
Flavour Fragr. J., 2007, 22, 3, 228-232, https://doi.org/10.1002/ffj.1790
. [all data]
Eri, Khoo, et al., 2000
Eri, S.; Khoo, B.K.; Lech, J.; Hartman, T.G.,
Direct thermal desorption-gas chromatography and gas chromatography-mass spectrometry profiling of hop (Humulus lupulus L.) essential oils in support of varietal characterization,
J. Agric. Food Chem., 2000, 48, 4, 1140-1149, https://doi.org/10.1021/jf9911850
. [all data]
Osorio, Alarcon, et al., 2006
Osorio, C.; Alarcon, M.; Moreno, C.; Bonilla, A.; Barrios, J.; Garzon, C.; Duque, C.,
Characterization of Odor-Active Volatiles in Champa ( Campomanesia lineatifolia R. P.),
J. Agric. Food Chem., 2006, 54, 2, 509-516, https://doi.org/10.1021/jf052098c
. [all data]
Gancel, Ollitrault, et al., 2005
Gancel, A.-L.; Ollitrault, P.; Froelicher, Y.; Tomi, F.; Jacquemond, C.; Luro, F.; Brillouet, J.-M.,
Leaf volatile compounds of six citrus somatic allotetraploid hybrids originating from various combinations of lime, lemon, citron, sweet orange, and grapefruit,
J. Agric. Food Chem., 2005, 53, 6, 2224-2230, https://doi.org/10.1021/jf048315b
. [all data]
Gancel, Ollitrault, et al., 2003
Gancel, A.-L.; Ollitrault, P.; Froelicher, Y.; Tomi, F.; Jacquemond, C.; Luro, F.; Brillouet, J.-M.,
Leaf volatile compounds of seven citrus somatic tetraploid hybrids sharing willow leaf mandarin (Citrus deliciosa Ten.) as their common parent,
J. Agric. Food Chem., 2003, 51, 20, 6006-6013, https://doi.org/10.1021/jf0345090
. [all data]
Wetwiayaklung, Thavanapong, et al., 2009
Wetwiayaklung, P.; Thavanapong, N.; Charoenteeraboon, J.,
Chemical constituents and antimicrobial activity os essential oil and extracts of heartwood of Aquilaria crassna obtained from water distillation and supercritical fluid carbon dioxide extraction,
Silpakorn U Sci. J., 2009, 3, 1, 25-33. [all data]
Zhao, Zeng, et al., 2009
Zhao, C.; Zeng, Y.; Wan, M.; Li, R.; Liang, Y.; Li, C.; Zeng, Z.; Chau, F.-T.,
Comparative analysis of essential oils from eight herbal medicines with pungent flavor and cool nature by GC-MS and chemometric resolution methods,
J. Sep. Sci., 2009, 32, 4, 660-670, https://doi.org/10.1002/jssc.200800484
. [all data]
Hachicha, Skanji, et al., 2007
Hachicha, S.F.; Skanji, T.; Barrek, S.; Ghrabi, Z.G.; Zarrouk, H.,
Composition of the essential oil of Teucrium ramosissimum Desf. (Lamiaceae) from Tunisia,
Flavour Fragr. J., 2007, 22, 2, 101-104, https://doi.org/10.1002/ffj.1764
. [all data]
Ghasemi Y., Faridi P., et al., 2005
Ghasemi Y.; Faridi P.; Mehregan I.; Mohagheghzadeh A.,
Ferula gummosa fruits: An aromatic antimicrobial agent,
Chem. Nat. Compd. (Engl. Transl.), 2005, 41, 3, 311-314, https://doi.org/10.1007/s10600-005-0138-3
. [all data]
Morteza-Semnani and Saeedi, 2005
Morteza-Semnani, K.; Saeedi, M.,
The essential oil composition of Hypericum androsaemum L. leaves and flowers from Iran,
Flavour Fragr. J., 2005, 20, 3, 332-334, https://doi.org/10.1002/ffj.1432
. [all data]
Simic, Sokovic, et al., 2004
Simic, A.; Sokovic, M.D.; Ristic, M.; Grujic-Jovanovic, S.; Vukojevic, J.; Marin, P.D.,
The chemical composition of some Lauraceae essential oils and their antifungal activities,
Phytother. Res., 2004, 18, 9, 713-717, https://doi.org/10.1002/ptr.1516
. [all data]
Orav, Kailas, et al., 2003
Orav, A.; Kailas, T.; Jegorova, A.,
Composition of the essential oil of dill, celery, and parsley from Estonia,
Proc. Est. Acad. Sci. Chem., 2003, 52, 4, 147-154. [all data]
Yassa, Akhani, et al., 2003
Yassa, N.; Akhani, H.; Aqaahmadi, M.; Salimian, M.,
Essential oils from two endemic species of Apiaceae from Iran,
Z. Naturforsch. C:, 2003, 58, 459-463. [all data]
Everaerts, Roisin, et al., 1993
Everaerts, C.; Roisin, Y.; Le Quere, J.-L.; Bonnard, O.; Pasteels, J.M.,
Sesquiterpenes in the frontal gland secretion of nasute soldier termites from New Guinea,
J. Chem. Ecol., 1993, 19, 12, 2865-2879, https://doi.org/10.1007/BF00980588
. [all data]
Miyazaki, Plotto, et al., 2011
Miyazaki, T.; Plotto, A.; Goodner, K.; Gmitter F.G.,
Distribution of aroma volatile compounds in tangerine hybrids and proposed inheritance,
J. Sci. Food Agric., 2011, 91, 3, 449-460, https://doi.org/10.1002/jsfa.4205
. [all data]
Wang, Xu, et al., 2011
Wang, J.; Xu, L.; Yang, L.; Liu, Z.; Zhou, L.,
Composition, antibacterial and antioxidant activities of essential oils from Ligusticum sinense and L. jaholense (Unvelliferae) from China,
Rec. Nat. Prod., 2011, 5, 4, 314-318. [all data]
Courtois, Paine, et al., 2009
Courtois, E.A.; Paine, C.E.; Blandinieres, P.-A.; Stien, D.; Bessiere, J.-M.; Houel, E.; Baraloto, C.; Chave, J.,
Diversity of the volatile organic compounds emitted by 55 species of tropical trees: a survey in French Guiana,
J. Chem. Ecol., 2009, 35, 11, 1349-1362, https://doi.org/10.1007/s10886-009-9718-1
. [all data]
Proffit, 2007
Proffit, M.,
Mediation chimique et structuration des communautes d'hymenopteres parasites du mutualisme figuier / pollinisateur (These pour obtenir le grade de Docteur de l'Universite Montpellier II) (Dissertation), 2007. [all data]
Setzer, Stokes, et al., 2007
Setzer, W.N.; Stokes, S.L.; Penton, A.F.; Takaku, S.; Haber, W.A.; Hansell, E.; Caffrey, C.R.; McKerrow, J.H.,
Cruzain inhibitory activity of leaf essential oils of neotropical Lauraceae and essential oil components,
Natural Product Communications, 2007, 2, 12, 1203-1210. [all data]
Takaku, Haber, et al., 2007
Takaku, S.; Haber, W.A.; Setzer, W.N.,
Leaf essential oil composition of 10 species of Ocotea (Lauraceae) from Monteverde, Costa Rica,
Biochem. Syst. Ecol., 2007, 35, 8, 525-532, https://doi.org/10.1016/j.bse.2007.02.003
. [all data]
Letchamo, Ward, et al., 2004
Letchamo, W.; Ward, W.; Heard, B.; Heard, D.,
Essential oil of Valeriana officinalis L. cultivars and their antimicrobial activity as influenced by harvesting time under commercial organic cultivation,
J. Agric. Food Chem., 2004, 52, 12, 3915-3919, https://doi.org/10.1021/jf0353990
. [all data]
Weyerstahl, Marschall, et al., 2000
Weyerstahl, P.; Marschall, H.; Splittgerber, U.; Wolf, D.; Surburg, H.,
Constituents of Haitian vetiver oil,
Flavour Fragr. J., 2000, 15, 6, 395-412, https://doi.org/10.1002/1099-1026(200011/12)15:6<395::AID-FFJ930>3.0.CO;2-9
. [all data]
Hymete, Rohloff, et al., 2007
Hymete, A.; Rohloff, J.; Iversen, T.-H.; Kjosen, H.,
Volatile constituents of the roots of Echinops kebericho Mesfin,
Flavour Fragr. J., 2007, 22, 1, 35-38, https://doi.org/10.1002/ffj.1746
. [all data]
Vinogradov, 2004
Vinogradov, B.A.,
Production, composition, properties and application of essential oils, 2004, retrieved from http://viness.narod.ru. [all data]
Baser, Demirci, et al., 2001
Baser, K.H.C.; Demirci, B.; Tabanca, N.; Özek, T.; Gören, N.,
Composition of the essential oils of Tanacetum armenum (DC.) Schultz Bip., T. balsamita L., T. chiliophyllum (Fisch. Mey.) Schultz Bip. var. chiliophyllum and T. haradjani (Rech. fil.) Grierson and the enantiomeric distribution of camphor and carvone,
Flavour Fragr. J., 2001, 16, 3, 195-200, https://doi.org/10.1002/ffj.977
. [all data]
Gören, Demirci, et al., 2001
Gören, N.; Demirci, B.; Baser, K.H.C.,
Composition of the essential oils of Tanacetum spp. from Turkey,
Flavour Fragr. J., 2001, 16, 3, 191-194, https://doi.org/10.1002/ffj.976
. [all data]
Tabanca, Kirimer, et al., 2001
Tabanca, N.; Kirimer, N.; Demirci, B.; Demirci, F.; Can Baser, K.H.,
Composition and antimicrobial activity of the essential oils of Micromeria cristata subsp. phrygia and the enantiomeric distribution of borneol,
J. Agric. Food Chem., 2001, 49, 9, 4300-4303, https://doi.org/10.1021/jf0105034
. [all data]