Bicyclo[3.1.1]hept-2-ene-2-methanol, 6,6-dimethyl-
- Formula: C10H16O
- Molecular weight: 152.2334
- IUPAC Standard InChIKey: RXBQNMWIQKOSCS-UHFFFAOYSA-N
- CAS Registry Number: 515-00-4
- Chemical structure:
View 3d structure (requires JavaScript / HTML 5) - Species with the same structure:
- Stereoisomers:
- Other names: 2-Pinen-10-ol; Myrtenol; 6,6-dimethyl-2-oxymethlybicyclo[1.1.3]-hept-2-ene (myrtenol); 6,6-Dimethyl-bicyclo[3,1,1]hept-2-ene-2-methanol; Myrtenol (α-pinene-10-ol); (-)-pin-2-ene-10-ol

Phase change data

Data compiled by: Robert L. Brown and Stephen E. Stein
Quantity | Value | Units | Method | Reference | Comment |
---|---|---|---|---|---|
Tboil | 494.7 | K | N/A | Aldrich Chemical Company Inc., 1990 |

Normal alkane RI, polar column, temperature ramp

Data compiled by: NIST Mass Spectrometry Data Center, William E. Wallace, director

Column type CapillaryCapillaryCapillaryCapillaryCapillary
Active phase RTX-WaxVF-Wax MSRTX-WaxHP-InnowaxTC-FFAP
Column length (m) 60.60.60.30.
Carrier gas HeliumHeliumHeliumNitrogenHe
Substrate
Column diameter (mm) 0.220.250.220.250.25
Phase thickness (μm) 0.250.250.250.520.25
Tstart (C) 60.60.60.35.60.
Tend (C) 230.220.230.205.220.
Heat rate (K/min) 2.3.2.3.3.
Initial hold (min)  5. 10.
Final hold (min) 5.25.30.10.30.
I 1763.1793.1772.1804.1801.
ReferenceBendiabdellah, El Amine Dib, et al., 2012Duarte, Dias, et al., 2010Museli, Pau, et al., 2009Wannes, Mhamdi, et al., 2009Kurose, Okamura, et al., 2007
Comment MSDC-RI MSDC-RI MSDC-RI MSDC-RI MSDC-RI
Column type CapillaryCapillaryCapillaryCapillaryCapillary
Active phase TC-FFAPSupelcowax-10Supelcowax-10Supelcowax-10Innowax
Column length (m)  30.30.30.30.
Carrier gas HeHeHeHeN2
Substrate
Column diameter (mm) 0.250.20.250.250.25
Phase thickness (μm) 0.250.20.250.250.25
Tstart (C) 60.70.50.40.50.
Tend (C) 220.220.250.250.280.
Heat rate (K/min) 3.3.2.3.9.
Initial hold (min)    5.3.
Final hold (min) 30.15. 10.3.
I 1798.1786.1794.1788.1791.
ReferenceKurose, Okamura, et al., 2007Pinto, Salgueiro, et al., 2007Raal, Orav, et al., 2007Vichi, Riu-Aumatell, et al., 2007Abdelwahed, Hayder, et al., 2006
Comment MSDC-RI MSDC-RI MSDC-RI MSDC-RI MSDC-RI
Column type CapillaryCapillaryCapillaryCapillaryCapillary
Active phase InnowaxSupelcowax 10CP-Wax 52CBSupelcowaxHP-Wax
Column length (m) 30.30.30.30.30.
Carrier gas N2HeliumHeN2Nitrogen
Substrate
Column diameter (mm) 0.250.200.320.320.25
Phase thickness (μm) 0.250.200.250.250.25
Tstart (C) 50.70.60.50.50.
Tend (C) 280.220.220.200.280.
Heat rate (K/min) 9.3.3.35.5.
Initial hold (min) 3. 7.
Final hold (min) 3.15.3. 5.
I 1792.1786.1796.1803.1782.
ReferenceAbdelwahed, Hayder, et al., 2006Cavaleiro, Pinto, et al., 2006Hymete, Rohloff, et al., 2006Martin, Joseph, et al., 2006Marzouk, Mansour, et al., 2006
Comment MSDC-RI MSDC-RI MSDC-RI MSDC-RI MSDC-RI
Column type CapillaryCapillaryCapillaryCapillaryCapillary
Active phase HP-20MNB-20MHP-InnowaxCarbowax 20MCP-Wax
Column length (m) 30.30.30.50.30.
Carrier gas N2HeHeHeliumHe
Substrate
Column diameter (mm) 0.250.20.250.250.32
Phase thickness (μm) 0.250.250.170.250.25
Tstart (C) 50.50.60.40.40.
Tend (C) 250.250.210.190.180.
Heat rate (K/min) 5.2.4.4.5.
Initial hold (min)   3.2.2.
Final hold (min) 10. 15.30.
I 1782.1796.1794.1786.1776.
ReferenceMarzouk, Neffati, et al., 2006Orav, Raal, et al., 2006Ferretti, Maggi, et al., 2005de la Fuente, Martinez-Castro, et al., 2005Ka, Choi, et al., 2005
Comment MSDC-RI MSDC-RI MSDC-RI MSDC-RI MSDC-RI
Column type CapillaryCapillaryCapillaryCapillaryCapillary
Active phase DB-WaxDB-WaxSupelcowax-10Supelcowax-10DB-Wax
Column length (m) 30.60.30.60.60.
Carrier gas HeNitrogen HeHe
Substrate
Column diameter (mm) 0.250.320.250.20.25
Phase thickness (μm) 0.250.500.250.2
Tstart (C) 50.35.40.60.60.
Tend (C) 180.235.220.200.220.
Heat rate (K/min) 3.2.3.4.2.
Initial hold (min)  4.5. 4.
Final hold (min) 40.30.10.40.
I 1789.1831.1788.1749.1797.
ReferenceLee, Umano, et al., 2005Qian and Wang, 2005Vichi, Riu-Aumatell, et al., 2005Gauvin, Ravaomanarivo, et al., 2004Jiang and Kubota, 2004
Comment MSDC-RI MSDC-RI MSDC-RI MSDC-RI MSDC-RI
Column type CapillaryCapillaryCapillaryCapillaryCapillary
Active phase Innowax FSCSupelcowax-10Supelcowax-10NB-20MDB-Wax
Column length (m) 60.50.50.50.60.
Carrier gas HeliumHeHeHe
Substrate
Column diameter (mm) 0.250.20.20.20.25
Phase thickness (μm)  0.250.250.250.25
Tstart (C) 60.70.70.50.70.
Tend (C) 220.230.230.250.230.
Heat rate (K/min) 4.2.2.2.2.
Initial hold (min) 10.   2.
Final hold (min)     20.
I 1804.1781.1784.1796.1812.
ReferenceLourens, Reddy, et al., 2004Orav, Stulova, et al., 2004Orav, Stulova, et al., 2004Raal, Arak, et al., 2004Sawamura, Son, et al., 2004
Comment MSDC-RI MSDC-RI MSDC-RI MSDC-RI MSDC-RI
Column type CapillaryCapillaryCapillaryCapillaryCapillary
Active phase DB-WaxInnowaxDB-WaxDB-WaxDB-Wax
Column length (m) 60.60.60.60.60.
Carrier gas NitrogenHeHe He
Substrate
Column diameter (mm) 0.250.250.250.250.25
Phase thickness (μm) 0.25 0.250.250.25
Tstart (C) 70.60.45.30.40.
Tend (C) 230.220.240.170.200.
Heat rate (K/min) 2.4.3.2.2.
Initial hold (min) 2.10. 4.2.
Final hold (min)  10. 30.
I 1812.1804.1787.1794.1793.
ReferenceSawamura, Sou, et al., 2004Suleimenov, Atazharova, et al., 2003Christoph, 2001Buttery, Light, et al., 2000Umano, Hagi, et al., 2000
Comment MSDC-RI MSDC-RI MSDC-RI MSDC-RI MSDC-RI
Column type CapillaryCapillaryCapillaryCapillaryCapillary
Active phase HP Innowax FSPInnowaxHP-InnowaxBP-20DB-Wax
Column length (m) 60.60.60.25.30.
Carrier gas HeHeHeH2N2
Substrate
Column diameter (mm) 0.250.250.250.330.25
Phase thickness (μm) 0.250.250.250.50.25
Tstart (C) 60.60.60.80.45.
Tend (C) 220.220.220.220.220.
Heat rate (K/min)    5.3.
Initial hold (min) 10.10.10.
Final hold (min) 10.
I 1808.1808.1808.1807.1807.
ReferenceKaya, Baser, et al., 1999Kaya, Baser, et al., 1999, 2Kaya, Baser, et al., 1999, 3Bignell, Dunlop, et al., 1998Mölleken, Sinnwell, et al., 1998
Comment MSDC-RI MSDC-RI MSDC-RI MSDC-RI MSDC-RI
Column type CapillaryCapillaryCapillaryCapillaryCapillary
Active phase BP-20BP-20BP-20BP-20BP-20
Column length (m) 25.25.25.25.25.
Carrier gas H2H2H2H2
Substrate
Column diameter (mm) 0.330.330.330.330.33
Phase thickness (μm) 0.50.50.50.50.5
Tstart (C) 80.80.80.80.80.
Tend (C) 220.220.220.220.220.
Heat rate (K/min) 5.5.5.5.5.
Initial hold (min)
Final hold (min)
I 1807.1807.1807.1807.1807.
ReferenceBignell, Dunlop, et al., 1997Bignell, Dunlop, et al., 1997, 2Bignell, Dunlop, et al., 1997, 3Bignell, Dunlop, et al., 1997, 4Bignell, Dunlop, et al., 1997, 5
Comment MSDC-RI MSDC-RI MSDC-RI MSDC-RI MSDC-RI
Column type CapillaryCapillaryCapillaryCapillaryCapillary
Active phase BP-20DB-WaxDB-WaxTC-WaxCarbowax 20M
Column length (m) 25.30.30.60.45.
Carrier gas H2HeHe Hydrogen
Substrate
Column diameter (mm) 0.330.250.250.250.32
Phase thickness (μm) 0.50.250.25 1.0
Tstart (C) 80.20.50.80.60.
Tend (C) 220.200.200.240.200.
Heat rate (K/min) 5.4.4.3.2.
Initial hold (min)  4.4.5.5.
Final hold (min)  10.10.
I 1807.1763.1788.1796.1784.
ReferenceBignell, Dunlop, et al., 1997, 6Morales, Albarracín, et al., 1996Morales, Albarracín, et al., 1996Shuichi, Masazumi, et al., 1996Kollmannsberger, Nitz, et al., 1992
Comment MSDC-RI MSDC-RI MSDC-RI MSDC-RI MSDC-RI
Column type Capillary
Active phase DB-Wax
Column length (m) 60.
Carrier gas
Substrate
Column diameter (mm) 0.32
Phase thickness (μm)
Tstart (C) 50.
Tend (C) 230.
Heat rate (K/min) 4.
Initial hold (min) 0.1
Final hold (min) 10.
I 1788.
ReferenceBinder, Flath, et al., 1989
Comment MSDC-RI

Van Den Dool and Kratz RI, non-polar column, custom temperature program

Data compiled by: NIST Mass Spectrometry Data Center, William E. Wallace, director

Column type CapillaryCapillaryCapillaryCapillaryCapillary
Active phase DB-5DB-5DB-5BP-1SE-54
Column length (m) 30.30.30.50.30.
Carrier gas HeHeHe He
Substrate
Column diameter (mm) 0.320.320.320.220.32
Phase thickness (μm) 1.1.1.0.250.25
Program 40C(2min) => 5C/min => 100C => 4C/min => 230C (10min)40C(2min) => 5C/min => 100C => 4C/min => 230C (10min)40C(2min) => 2C/min => 100C => 10C/min => 230C (5min)not specified35C (2min) => 40C/min => 60C (2min) => 6C/min => 180C => 10C/min => 230C (5min)
I 1242.1214.1218.1181.1206.
ReferenceWang, Finn, et al., 2005Wang, Finn, et al., 2005Klesk and Qian, 2003Cavalli, Ranarivelo, et al., 2001Tairu, Hofmann, et al., 1999
Comment MSDC-RI MSDC-RI MSDC-RI MSDC-RI MSDC-RI
Column type Capillary
Active phase SE-54
Column length (m) 30.
Carrier gas He
Substrate
Column diameter (mm) 0.32
Phase thickness (μm) 0.25
Program 35 0C 40 0C/min -> 60 0C (2 min) 6 0C/min -> 180 0C 10 0C/min -> 230 0C
I 1206.
ReferenceTairu, Hofmann, et al., 1999, 2
Comment MSDC-RI

Kovats' RI, non-polar column, isothermal

Data compiled by: NIST Mass Spectrometry Data Center, William E. Wallace, director

Column type CapillaryCapillaryCapillaryCapillary
Active phase DB-1SE-30SE-30PB-1
Column length (m) 28. 40.42.
Carrier gas He
Substrate
Column diameter (mm) 0.25 0.350.32
Phase thickness (μm) 0.25 0.35
Temperature (C) 150.120.100.130.
I 1184.1186.1185.81195.
ReferenceViswanathan, Maridass, et al., 2002Tudor and Moldovan, 1999Tudor, 1997Engewald, Knobloch, et al., 1991
Comment MSDC-RI MSDC-RI MSDC-RI MSDC-RI

Normal alkane RI, non-polar column, custom temperature program

Data compiled by: NIST Mass Spectrometry Data Center, William E. Wallace, director

Column type CapillaryCapillaryCapillaryCapillaryCapillary
Active phase DB-1HP-5 MSRTX-1HP-55 % Phenyl polydimethyl siloxane
Column length (m) 30.30.60.30.
Carrier gas HydrogenHeliumHeliumNitrogen
Substrate
Column diameter (mm) 0.250.250.220.35
Phase thickness (μm) 0.250.250.250.25
Program 45 0C 3 0C/min -> 175 0C 15 0C/min -> 300 0C (10 min)40 0C (5 min) 6 0C -> 120 0C (5 min) 8 0C/min -> 300 0Cnot specified60 0C 3 0C/min -> 210 0C 5 0C/min -> 250 0C (2 min)not specified
I 1168.1201.1182.1208.1197.
ReferenceAlbano, Lima, et al., 2012Attia, Grissa, et al., 2012Bendiabdellah, El Amine Dib, et al., 2012Veres, Csupor-Loffler, et al., 2012Chaverri, Diaz, et al., 2011
Comment MSDC-RI MSDC-RI MSDC-RI MSDC-RI MSDC-RI
Column type CapillaryCapillaryCapillaryCapillaryCapillary
Active phase HP-5HP-5 MSHP-5 MSHP-5 MSZB-1 MS
Column length (m) 30.  30.30.
Carrier gas Helium  HeliumHelium
Substrate
Column diameter (mm) 0.25  0.250.25
Phase thickness (μm) 0.25  0.250.25
Program 60 0C (1 min) 10 0C/min -> 180 0C (1 min) 20 0C/min -> 280 0C (15 min)not specifiednot specified60 0C (1 min) 10 0C/min -> 180 0C (1 min) 20 0C/min -> 280 0C (15 min)50 0C 3 0C/min -> 150 0C (10 min) 10 0C/min -> 250 0C
I 1196.1202.1214.1196.1191.
ReferenceWang, Liu, et al., 2011Hohaus, Trimborn, et al., 2010Hohaus, Trimborn, et al., 2010Liu, Chu, et al., 2010Bajpai, Al-Reza, et al., 2009
Comment MSDC-RI MSDC-RI MSDC-RI MSDC-RI MSDC-RI
Column type CapillaryCapillaryCapillaryCapillaryCapillary
Active phase HP-5HP-55 % Phenyl methyl siloxaneHP-5 MSDB-1
Column length (m) 25.25.30.30.30.
Carrier gas HeliumHeliumHeliumHeliumHydrogen
Substrate
Column diameter (mm) 0.320.320.250.250.25
Phase thickness (μm) 0.170.170.250.250.25
Program 60 0C (5 min) 4 0C/min -> 220 0C 11 0C/min -> 280 0C (15 min)not specified50 0C (2 min) 10 0C/min -> 150 0C 15 0C/min -> 300 0C (10 min)40 0C (5 min) 2 0C/min -> 270 0C -> 260 0C (20 min)45 0C 3 0C/min -> 175 0C 15 0C/min -> 300 0C (10 min)
I 1199.1195.1201.1196.1168.
ReferenceCuster, 2009Custer, 2009Huang, Qin, et al., 2009Mancini, Arnold, et al., 2009Mendes, Trindade, et al., 2009
Comment MSDC-RI MSDC-RI MSDC-RI MSDC-RI MSDC-RI
Column type CapillaryCapillaryCapillaryCapillaryCapillary
Active phase SPB-5SPB-5DB-1HP-5MSDB-1
Column length (m)   30.30.30.
Carrier gas   HeHeH2
Substrate
Column diameter (mm)   0.250.250.25
Phase thickness (μm)   0.250.250.25
Program not specifiednot specified45C => 3C/min => 175C => 15C/min => 300C (10min)40C(10min) => 3C/min => 200C => 2C/min => 220C45 0C 3 0C/min -> 175 0C 15 0C/min -> 300 0C (10 min)
I 1196.1207.1168.1196.1168.
ReferenceKilani, Ledauphin, et al., 2008Kilani, Ledauphin, et al., 2008Nogueira, Marcelo-Curto, et al., 2008Cole, Haber, et al., 2007Kamatou, Viljoen, et al., 2007
Comment MSDC-RI MSDC-RI MSDC-RI MSDC-RI MSDC-RI
Column type CapillaryCapillaryCapillaryCapillaryCapillary
Active phase HP-1DB-5HP-5 MSHP-5 MSDB-1
Column length (m) 30.30.30.30.30.
Carrier gas HeHydrogenHeliumHeliumHe
Substrate
Column diameter (mm) 0.20.250.250.250.25
Phase thickness (μm) 0.330.25 0.250.25
Program 60C(5min) => 3C/min => 180C => 20C/min => 280C(10min)35 0C (2 min) 4 0C/min -> 180 0C 20 0C -> 280 0C40 0C (10 min) 3 oC/min -> 200 0C 2 0C/min -> 220 0Cnot specified45C => 3C/min => 175C => 15C/min => 300C (10min)
I 1199.1198.1196.1194.1168.
ReferenceMerle, Verdeguer, et al., 2007Pontes, de Oliveira, et al., 2007Setzer, Stokes, et al., 2007Sharififar, Mozaffarian, et al., 2007Figueiredo A.C., Barroso J.G., et al., 2006
Comment MSDC-RI MSDC-RI MSDC-RI MSDC-RI MSDC-RI
Column type CapillaryCapillaryCapillaryCapillaryCapillary
Active phase HP-5DB-5HP-5MSSE-52CP Sil 8 CB
Column length (m) 30.30.30.30.50.
Carrier gas  HeHeHeHe
Substrate
Column diameter (mm) 0.250.250.250.320.32
Phase thickness (μm) 0.250.250.250.150.25
Program >2.5C/min => 180C => 100C/min => 250C (7.3min)40C (5min) => 2C/min => 250C(15min) => 5C/min => 270C (10min)40C(5min) => 2C/min => 250C (15min) => 10C/min => 270C45C => 1C/min => 100C => 5C/min => 250C (10min)50C(5min) => 2C/min => 90C => 15C/min => 240C(4min)
I 1208.1196.1196.1196.1196.
ReferenceGoodner, Mahattanatawee, et al., 2006Massardo, Senatore, et al., 2006Senatore, Apostolides Arnold, et al., 2006Tognolini, Barocelli, et al., 2006Butkienë, Nivinskienë, et al., 2005
Comment MSDC-RI MSDC-RI MSDC-RI MSDC-RI MSDC-RI
Column type CapillaryCapillaryCapillaryCapillaryCapillary
Active phase DB-5BPX-5BPX-5CP Sil 8 CBMethyl Silicone
Column length (m) 30.30.30.50.
Carrier gas He HeHe
Substrate
Column diameter (mm) 0.250.250.320.32
Phase thickness (μm) 0.250.250.50.25
Program 40C(1min) => 9C/min => 130C => 2C/min => 230C60C(0.2min) => 3K/min => 186C => 10C/min => 240C (5min)60C(1min) => 3.5C/min => 180C => 20C/min => 280C(2min)50C(5min) => 2C/min => 90C => 15C/min => 240C(4min)not specified
I 1198.1193.1188.1196.1194.
ReferenceHamm, Bleton, et al., 2005Judzentiene and Mockute, 2005Koutsoudaki, Krsek, et al., 2005Butkienë, Nivinskienë, et al., 2004Couladis, Özcan, et al., 2004
Comment MSDC-RI MSDC-RI MSDC-RI MSDC-RI MSDC-RI
Column type CapillaryCapillaryCapillaryCapillaryCapillary
Active phase  OV-1DB-5DB-1HP-5
Column length (m)  30.30.30.30.
Carrier gas  HeHeHe
Substrate
Column diameter (mm)  0.250.250.250.25
Phase thickness (μm)  0.250.250.250.25
Program not specified45 0C (4 min) 3 0C/min -> 75 0C 4 0C/min -> 115 0C 6 0C/min -> 312 0C40C(1min) => 9C/min => 130C => 2C/min => 230C45C => 3C/min => 175C => 15C/min => 300C (10min)40C(5min) => 2C/min => 250C(15min) => 10C/min => 270C
I 1189.1178.1198.1168.1196.
ReferenceEl-Shazily, Hafez, et al., 2004Hafez and Abdel-Salam, 2004Hamm, Bleton, et al., 2004Miguel, Simões, et al., 2004Senatore, Apostolides Arnold, et al., 2004
Comment MSDC-RI MSDC-RI MSDC-RI MSDC-RI MSDC-RI
Column type CapillaryCapillaryCapillaryCapillaryCapillary
Active phase HP-5DB-5SE-30CP Sil 8 CBCP Sil 8 CB
Column length (m) 30.  50.50.
Carrier gas He  HeHe
Substrate
Column diameter (mm) 0.25  0.320.32
Phase thickness (μm) 0.25  0.250.25
Program 50C (3min) => 3C/min => 150C (10min) => 10C/min => 250Cnot specifiednot specified70C(5min) => 3C/min => 100C (1min) => 25C/min => 250C (10min)60C(1min) => 5C/min => 160C => 10C/min => 250C(5min)
I 1196.1194.1190.1194.1194.
ReferenceTepe, Donmez, et al., 2004Vilaseca, Guy, et al., 2004Vinogradov, 2004Mockute and Judzentiene, 2003Mockute, Nivinskiene, et al., 2003
Comment MSDC-RI MSDC-RI MSDC-RI MSDC-RI MSDC-RI
Column type CapillaryCapillaryCapillaryCapillaryCapillary
Active phase HP-1CP Sil 5 CBCP Sil 5 CBDB-1CP Sil 5 CB
Column length (m) 30.25.25.30.30.
Carrier gas HeHeN2HeN2
Substrate
Column diameter (mm) 0.32  0.250.25
Phase thickness (μm) 0.250.390.390.25
Program 40C(3min) => 5C/min => 180C => 15C/min => 240C(15min)not specifiednot specified45C => 3C/min => 175C => 15C/min => 280Cnot specified
I 1201.1180.1183.1168.1187.
ReferenceNogueira and Romano, 2002Weyerstahl, Marschall, et al., 1998Weyerstahl, Marschall, et al., 1998, 2Gaspar, Palma, et al., 1997Weyerstahl, Marschall, et al., 1997
Comment MSDC-RI MSDC-RI MSDC-RI MSDC-RI MSDC-RI
Column type CapillaryCapillaryCapillaryCapillaryCapillary
Active phase Polydimethyl siloxanesDB-1DB-5DB-5DB-1
Column length (m)  30.30.30.60.
Carrier gas  H2
Substrate
Column diameter (mm)  0.250.250.250.32
Phase thickness (μm)  0.25
Program not specified45 0C 3 0C/min -> 175 0C 15 0C/min -> 240 0C (10 min)not specifiednot specifiednot specified
I 1187.1168.1191.1192.1177.
ReferenceZenkevich, 1997Barroso, Figueiredo, et al., 1996Garneau, Bouhajib, et al., 1994Jean, Garneau, et al., 1993Binder, Flath, et al., 1989
Comment MSDC-RI MSDC-RI MSDC-RI MSDC-RI MSDC-RI
Column type Capillary
Active phase OV-101
Column length (m)
Carrier gas
Substrate
Column diameter (mm)
Phase thickness (μm)
Program not specified
I 1189.
ReferenceDe Pooter, Vermeesch, et al., 1989
Comment MSDC-RI

Kovats' RI, polar column, temperature ramp

Data compiled by: NIST Mass Spectrometry Data Center, William E. Wallace, director

Column type CapillaryCapillary
Active phase DB-WaxSupelcowax-10
Column length (m) 30.30.
Carrier gas HeHe
Substrate
Column diameter (mm) 0.250.32
Phase thickness (μm) 0.250.25
Tstart (C) 60.75.
Tend (C) 220.230.
Heat rate (K/min) 2.3.
Initial hold (min) 5.
Final hold (min) 5.
I 1767.1783.
ReferenceNagarajan, Rao, et al., 2001Tzakou and Couladis, 2001
Comment MSDC-RI MSDC-RI

References

Aldrich Chemical Company Inc., 1990
Aldrich Chemical Company Inc.,
Catalog Handbook of Fine Chemicals, Aldrich Chemical Company, Inc., Milwaukee WI, 1990, 1. [all data]