1,3-Cyclohexadiene, 1,2,6,6-tetramethyl-
- Formula: C10H16
- Molecular weight: 136.2340
- IUPAC Standard InChIKey: RSTKTCUSOWRUNR-UHFFFAOYSA-N
- CAS Registry Number: 514-96-5
- Chemical structure:
View 3d structure (requires JavaScript / HTML 5) - Other names: β-Pyronene; 1,2,6,6-Tetramethyl-1,3-Cyclohexadiene

Normal alkane RI, non-polar column, temperature ramp

Column type | Active phase | I | Reference | Comment |
---|---|---|---|---|
Capillary | CP Sil 8 CB | 970. | Wang and Guo-Y. -L., 2004 | 30. m/0.25 mm/0.25 μm, He, 50. C @ 3. min, 10. K/min, 200. C @ 2. min |

Normal alkane RI, non-polar column, custom temperature program

Column type | Active phase | I | Reference | Comment |
---|---|---|---|---|
Capillary | SE-30 | 993. | Vinogradov, 2004 | Program: not specified |
Capillary | DB-5 | 999. | Isidorov, Zenkevich, et al., 1997 | Program: not specified |
Capillary | Methyl Silicone | 992. | Zenkevich, 1996 | Program: not specified |

References

Wang and Guo-Y. -L., 2004
Wang, H.-Y.; Guo-Y. -L.,
Rapid analysis of the volatile compounds in the rhizomes of Rhodiola sachalinensis and Rhodiola sacra by static headspace-gas chromatography-tandem mass spectrometry,
Anal. Letters, 2004, 37, 10, 2151-2161, https://doi.org/10.1081/AL-200026690
. [all data]
Vinogradov, 2004
Vinogradov, B.A.,
Production, composition, properties and application of essential oils, 2004, retrieved from http://viness.narod.ru. [all data]
Isidorov, Zenkevich, et al., 1997
Isidorov, V.; Zenkevich, I.; Sacharevich, T.,
Calculation of Gas Chromatographic Retention Indices for Monoterpenes and Terpenoids from Their Physico-Chemical Constants,
Chem. Anal. (Warsaw), 1997, 42, 627-634. [all data]
Zenkevich, 1996
Zenkevich, I.G.,
Analytical Parameters of Components of Essential Oils for their Chromatographic and Chromato-Mass Spectral Identification. Mono- and Sesquiterpenes,
Rastitelnye Resursy (Plant resources), 1996, 34, 1-2, 48-58. [all data]