Ferruginol
- Formula: C20H30O
- Molecular weight: 286.4516
- IUPAC Standard InChIKey: QXNWVJOHUAQHLM-QUCCMNQESA-N
- CAS Registry Number: 514-62-5
- Chemical structure:
View 3d structure (requires JavaScript / HTML 5) - Stereoisomers:
- Other names: trans-Ferruginol; Podocarpa-8,11,13-trien-12-ol, 13-isopropyl-; (4bS,8aS)-2-Isopropyl-4b,8,8-trimethyl-4b,5,6,7,8,8a,9,10-octahydrophenanthren-3-ol; Abieta-9(11),8(14),12-trien-12-ol

Kovats' RI, non-polar column, temperature ramp

Column type | Active phase | I | Reference | Comment |
---|---|---|---|---|
Capillary | DB-5 | 2325. | Adams and Nguyen, 2005 | 30. m/0.26 mm/0.25 μm, He, 3. K/min; Tstart: 60. C; Tend: 246. C |
Capillary | SE-54 | 2325. | Adams, 2000 | 30. m/0.26 mm/0.25 μm, He, 3. K/min; Tstart: 60. C; Tend: 246. C |
Capillary | SE-54 | 2325. | Adams, 2000, 2 | 30. m/0.26 mm/0.25 μm, 3. K/min; Tstart: 60. C; Tend: 246. C |
Capillary | DB-5 | 2325. | Adams, 2000, 3 | 30. m/0.26 mm/0.25 μm, He, 3. K/min; Tstart: 60. C; Tend: 246. C |
Capillary | DB-5 | 2325. | Adams, 1999 | 30. m/0.26 mm/0.25 μm, He, 3. K/min; Tstart: 60. C; Tend: 246. C |

Van Den Dool and Kratz RI, non-polar column, temperature ramp

Column type | Active phase | I | Reference | Comment |
---|---|---|---|---|
Capillary | BP-1 | 2283. | Gonny, Cavaleiro, et al., 2006 | 50. m/0.22 mm/0.25 μm, He, 2. K/min, 220. C @ 20. min; Tstart: 60. C |
Capillary | HP-5 | 2330. | Karioti, Skaltsa, et al., 2003 | 30. m/0.25 mm/0.25 μm, He, 60. C @ 5. min, 4. K/min; Tend: 280. C |
Capillary | HP-5MS | 2325. | Demetzos, Angelopoulou, et al., 2002 | 30. m/0.25 mm/0.25 μm, 50. C @ 5. min, 3. K/min; Tend: 280. C |
Capillary | HP-5MS | 2325. | Skaltsa, Mavrommati, et al., 2001 | 30. m/0.25 mm/0.25 μm, He, 60. C @ 5. min, 4. K/min; Tend: 280. C |

Van Den Dool and Kratz RI, non-polar column, custom temperature program

Column type | Active phase | I | Reference | Comment |
---|---|---|---|---|
Capillary | HP-5MS | 2335.7 | Andriamaharavo, 2014 | 30. m/0.25 mm/0.25 μm, He; Program: 60C (1 min) => 5 C/min => 210C => 10 C/min => 280C (15 min) |

Normal alkane RI, non-polar column, temperature ramp

Column type | Active phase | I | Reference | Comment |
---|---|---|---|---|
Capillary | DB-5 | 2332. | Ho, Wang, et al., 2010 | 30. m/0.25 mm/0.25 μm, Helium, 2. K/min; Tstart: 50. C; Tend: 250. C |
Capillary | HP-5 MS | 2325. | Adams, Beauchamp, et al., 2007 | 30. m/0.25 mm/0.25 μm, Helium, 50. C @ 10. min, 3. K/min, 230. C @ 10. min |
Capillary | HP-5 | 2325. | Cheraif, Ben Jannet, et al., 2007 | 30. m/0.25 mm/0.25 μm, N2, 50. C @ 1. min, 5. K/min, 240. C @ 4. min |
Capillary | DB-5 | 2297. | Marongiu, Porcedda, et al., 2003 | 30. m/0.25 mm/0.25 μm, He, 3. K/min, 280. C @ 30. min; Tstart: 60. C |
Capillary | HP-5 | 2317. | Velickovic, Randjelovic, et al., 2003 | 25. m/0.32 mm/0.53 μm, H2, 4. K/min; Tstart: 40. C; Tend: 280. C |
Capillary | HP-5 | 2332. | Velickovic, Randjelovic, et al., 2003 | 25. m/0.32 mm/0.53 μm, H2, 4. K/min; Tstart: 40. C; Tend: 280. C |

Normal alkane RI, non-polar column, custom temperature program

Column type | Active phase | I | Reference | Comment |
---|---|---|---|---|
Capillary | HP-5 | 2308. | Vichi, Aumatell, et al., 2008 | 30. m/0.25 mm/0.25 μm, Helium; Program: 130 0C 5 0C/min -> 240 0C 15 0C/min -> 320 0C (10 min) |

Normal alkane RI, polar column, temperature ramp

Column type | Active phase | I | Reference | Comment |
---|---|---|---|---|
Capillary | HP-Innowax | 2295. | Bousaada, Ammar, et al., 2008 | 30. m/0.25 mm/0.25 μm, Nitrogen, 50. C @ 1. min, 5. K/min, 280. C @ 1. min |

References

Adams and Nguyen, 2005
Adams, R.P.; Nguyen, S.,
Infra-specific variation in Juniperus deppeana and F. Sperryi in the Davis Mountains of Texas: variation in leaf essential oils and random amplified polymorphic DNAS (RAPDS),
Phytologia, 2005, 87, 2, 96-108. [all data]
Adams, 2000
Adams, R.P.,
Systematics of smooth leaf margin Juniperus of the western hemisphere based on leaf essential oils and RAPD DNA fingerprinting,
Biochem. Syst. Ecol., 2000, 28, 2, 149-162, https://doi.org/10.1016/S0305-1978(99)00047-2
. [all data]
Adams, 2000, 2
Adams, R.P.,
Systematics of the one seeded Juniperus of the eastern hemisphere based on leaf essential oils and random amplified polymorphic DNAs (RAPDs),
Biochem. Syst. Ecol., 2000, 28, 6, 529-543, https://doi.org/10.1016/S0305-1978(99)00096-4
. [all data]
Adams, 2000, 3
Adams, R.P.,
The serrate leaf margined Juniperus (Section Sabina) of the western hemisphere: systematics and evolution based on leaf essential oils and Random Amplified Polymorphic DNAs (RAPDs),
Biochem. Syst. Ecol., 2000, 28, 10, 975-989, https://doi.org/10.1016/S0305-1978(00)00022-3
. [all data]
Adams, 1999
Adams, R.P.,
Systematics of multi-seeded eastern hemisphere Juniperus based on leaf essential oils and RAPD DNA fingerprinting,
Biochem. Syst. Ecol., 1999, 27, 7, 709-725, https://doi.org/10.1016/S0305-1978(99)00016-2
. [all data]
Gonny, Cavaleiro, et al., 2006
Gonny, M.; Cavaleiro, C.; Salgueiro, L.; Casanova, J.,
Analysis of Juniperus communis subsp. alpina needle, berry, wood and root oils by combination of GC, GC/MS and 13C-NMR,
Flavour Fragr. J., 2006, 21, 1, 99-106, https://doi.org/10.1002/ffj.1527
. [all data]
Karioti, Skaltsa, et al., 2003
Karioti, A.; Skaltsa, H.; Demetzos, C.; Perdetzoglou, D.; Economakis, C.D.; Salem, A.B.,
Effect of nitrogen concentration of the nutrient solution on the volatile constituents of leaves of Salvia fruticosa Mill. in solution culture,
J. Agric. Food Chem., 2003, 51, 22, 6505-6508, https://doi.org/10.1021/jf030308k
. [all data]
Demetzos, Angelopoulou, et al., 2002
Demetzos, C.; Angelopoulou, D.; Perdetzoglou, D.,
A comparative study of the essential oils of Cistus salviifolius in several populations of Crete (Greece),
Biochem. Syst. Ecol., 2002, 30, 7, 651-665, https://doi.org/10.1016/S0305-1978(01)00145-4
. [all data]
Skaltsa, Mavrommati, et al., 2001
Skaltsa, H.D.; Mavrommati, A.; Constantinidis, T.,
A chemotaxonomic investigation of volatile constituents in Stachys subsect. Swainsonianeae (Labiatae),
Phytochemistry, 2001, 57, 2, 235-244, https://doi.org/10.1016/S0031-9422(01)00003-6
. [all data]
Andriamaharavo, 2014
Andriamaharavo, N.R.,
Retention Data. NIST Mass Spectrometry Data Center., NIST Mass Spectrometry Data Center, 2014. [all data]
Ho, Wang, et al., 2010
Ho, C.-L.; Wang, E.I.-C.; Yu, H.-T.; Yu, H.-M.; Su, Y.-C.,
Composition amd antioxidant activities of essential oils of different tissues from Cryptomeria japonica D. Don,
Quarterly J. Chin. Forestry, 2010, 32, 1, 63-76. [all data]
Adams, Beauchamp, et al., 2007
Adams, R.P.; Beauchamp, P.S.; Dev, V.; Dutz, S.M.,
New Natural Products Isolated from One-Seeded Juniperus of the Southwestern United States: Isolation and Occurence of 2-Ethenyl-3-methyl Phanol and Its Derivatives,
J. Essent. Oil Res., 2007, 19, 2, 146-152, https://doi.org/10.1080/10412905.2007.9699247
. [all data]
Cheraif, Ben Jannet, et al., 2007
Cheraif, I.; Ben Jannet, H.; Hammami, M.; Khouja, M.L.; Mighri, Z.,
Chemical composition and antimicrobial activity of essential oils of Cupressus arizonica Greene,
Biochem. Syst. Ecol., 2007, 35, 12, 813-820, https://doi.org/10.1016/j.bse.2007.05.009
. [all data]
Marongiu, Porcedda, et al., 2003
Marongiu, B.; Porcedda, S.; Caredda, A.; de Gioannis, B.; Vargiu, L.; la Colla, P.,
Extraction of Juniperus oxycedrus ssp. Oxycedrus essential oil by supercritical carbon dioxide: influence of some process parameters and biological activity,
Flavour Fragr. J., 2003, 18, 5, 390-397, https://doi.org/10.1002/ffj.1224
. [all data]
Velickovic, Randjelovic, et al., 2003
Velickovic, D.T.; Randjelovic, N.V.; Ristic, M.S.; Velickovic, A.S.; Smelcerovic, A.A.,
Chemical constituents and antimicrobial activity of the ethanol extracts obtained from the flower, leaf, and stem of Salvia officinalis L.,
J. Serb. Chem. Soc., 2003, 68, 1, 17-24, https://doi.org/10.2298/JSC0301017V
. [all data]
Vichi, Aumatell, et al., 2008
Vichi, S.; Aumatell, M.R.; Buxaderas, S.; Lopez-Tamames, E.,
Assessment of some diterpenoids in commercial distilled gin,
Anal. Chim. Acta, 2008, 628, 2, 222-229, https://doi.org/10.1016/j.aca.2008.09.005
. [all data]
Bousaada, Ammar, et al., 2008
Bousaada, O.; Ammar, S.; Saidana, D.; Chriaa, J.; Chraif, I.; Daami, M.; Helal, A.N.; Mighri, Z.,
Chemical composition and antimicrobial activity of volatile components from capitula and aerial parts of Rhaponticum acaule DC growing wild in Tunisia,
Microbiol. Res., 2008, 163, 1, 87-95, https://doi.org/10.1016/j.micres.2007.02.010
. [all data]