1H-Tetrazole, 1,5-dimethyl-
- Formula: C3H6N4
- Molecular weight: 98.1065
- IUPAC Standard InChIKey: HWHNFJYQDMSYAF-UHFFFAOYSA-N
- CAS Registry Number: 5144-11-6
- Chemical structure:
View 3d structure (requires JavaScript / HTML 5) - Other names: 1,5-Dimethyltetrazole; 1,5-dimethyl-1H-tetrazole

Gas phase thermochemistry data

Data compiled by: Hussein Y. Afeefy, Joel F. Liebman, and Stephen E. Stein
Quantity | Value | Units | Method | Reference | Comment |
---|---|---|---|---|---|
ΔfH°gas | 273.2 ± 2.9 | kJ/mol | Ccb | Kozyro, Simirskii, et al., 1990 |

Condensed phase thermochemistry data

Data compiled by: Hussein Y. Afeefy, Joel F. Liebman, and Stephen E. Stein
Quantity | Value | Units | Method | Reference | Comment |
---|---|---|---|---|---|
ΔfH°liquid | 186.1 ± 2.7 | kJ/mol | Ccb | Kozyro, Simirskii, et al., 1990 | |
Quantity | Value | Units | Method | Reference | Comment |
ΔcH°liquid | -2224.2 ± 2.6 | kJ/mol | Ccb | Kozyro, Simirskii, et al., 1990 | |
Quantity | Value | Units | Method | Reference | Comment |
ΔfH°solid | 188.6 | kJ/mol | Ccb | McEwan and Rigg, 1951 | |
Quantity | Value | Units | Method | Reference | Comment |
ΔcH°solid | -2226.7 ± 3.6 | kJ/mol | Ccb | McEwan and Rigg, 1951 |

Phase change data

Data compiled as indicated in comments:
TRC - Thermodynamics Research Center, NIST Boulder Laboratories, Chris Muzny director
ALS - Hussein Y. Afeefy, Joel F. Liebman, and Stephen E. Stein
DRB - Donald R. Burgess, Jr.
AC - William E. Acree, Jr., James S. Chickos
Quantity | Value | Units | Method | Reference | Comment |
---|---|---|---|---|---|
Ttriple | 349. | K | N/A | Kozyro, Simirskii, et al., 1990, 2 | Uncertainty assigned by TRC = 1. K; Det. with triple heat bridge; TRC |
Ttriple | 350.0 | K | N/A | Vorob'eva, 1990 | Uncertainty assigned by TRC = 1. K; TRC |
Quantity | Value | Units | Method | Reference | Comment |
ΔvapH° | 87.1 ± 1.0 | kJ/mol | V | Kozyro, Simirskii, et al., 1990 | ALS |
ΔvapH° | 87.1 | kJ/mol | N/A | Kozyro, Simirskii, et al., 1990 | DRB |
Enthalpy of sublimation
ΔsubH (kJ/mol) | Temperature (K) | Method | Reference | Comment |
---|---|---|---|---|
86.2 ± 1.0 | 303. to 343. | ME | Kozyro, Simirskii, et al., 1990, 3 | AC |
Enthalpy of fusion
ΔfusH (kJ/mol) | Temperature (K) | Reference | Comment |
---|---|---|---|
14.7 | 349. | Kozyro, Simirskii, et al., 1990, 4 | AC |

References

Kozyro, Simirskii, et al., 1990
Kozyro, A.A.; Simirskii, V.V.; Krasulin, A.P.; Sevruk, V.M.; Kabo, G.Ya.; Frenkel, M.L.; Gaponik, P.N.; Grigor'ev, Yu.V.,
Thermodynamic properties of tetrazole derivatives in different aggregation states,
Russ. J. Phys. Chem. (Engl. Transl.), 1990, 64, 348-350. [all data]
McEwan and Rigg, 1951
McEwan, W.S.; Rigg, M.W.,
The heats of combustion of compounds containing the tetrazole ring,
J. Am. Chem. Soc., 1951, 73, 4725-4727. [all data]
Kozyro, Simirskii, et al., 1990, 2
Kozyro, A.A.; Simirskii, V.V.; Kabo, G.Y.; Frenkel, M.L.; Krasulin, A.P.; Sevruk, V.M.; Sokolov, N.A.,
Additivity of the thermochemical characteristics of tetraalklyl-substituted carbamides,
Zh. Fiz. Khim., 1990, 64, 2360. [all data]
Vorob'eva, 1990
Vorob'eva, V.P.,
Enthalpies of phase transitions of tetrazole derivatives
in Vses. Konf. Term. Org. Soedin. 6th, Minsk, p 31, 1990. [all data]
Kozyro, Simirskii, et al., 1990, 3
Kozyro, A.A.; Simirskii, V.V.; Krasulin, A.P.; Sevruk, V.M.; Kabo, G.Y.; Frenkel, M.L.; Gaponik, P.N.; Grigor'ev, Y.V.,
Russ. J. Phys. Chem., 1990, 64, 348. [all data]
Kozyro, Simirskii, et al., 1990, 4
Kozyro, A.A.; Simirskii, V.V.; Krasulin, A.P.; Sevruk, V.M.; Kabo, G.Y.; Frenkel, M.L.; Gaponik, P.N.; Grigor'ev, Y.V.,
Thermodynamic properties of tetrazole derivatives in different aggregation states,
Zh. Fiz. Khim., 1990, 64, 656. [all data]