1-Propene, 1-chloro-2-methyl-
- Formula: C4H7Cl
- Molecular weight: 90.551
- IUPAC Standard InChIKey: KWISWUFGPUHDRY-UHFFFAOYSA-N
- CAS Registry Number: 513-37-1
- Chemical structure:
View 3d structure (requires JavaScript / HTML 5) - Other names: Propene, 1-chloro-2-methyl-; α-Chloroisobutylene; β,β-Dimethylvinyl chloride; Isocrotyl chloride; 1-Chloro-2-methyl-1-propene; 1-Chloro-2-methylpropene; 2-Methyl-1-chloropropene; 2-Methyl-1-propenyl chloride; 1-Chloroisobutylene; Dimethylvinylchloride; 2,2-Dimethylvinyl chloride; NCI-C54819

Phase change data

Data compiled as indicated in comments:
BS - Robert L. Brown and Stephen E. Stein
TRC - Thermodynamics Research Center, NIST Boulder Laboratories, Chris Muzny director
AC - William E. Acree, Jr., James S. Chickos
Quantity | Value | Units | Method | Reference | Comment |
---|---|---|---|---|---|
Tboil | 341.2 | K | N/A | Aldrich Chemical Company Inc., 1990 | BS |
Tboil | 341.15 | K | N/A | Kirrmann, 1948 | Uncertainty assigned by TRC = 2. K; TRC |
Tboil | 341.25 | K | N/A | Burgin, Hearne. G., et al., 1941 | Uncertainty assigned by TRC = 1. K; TRC |
Enthalpy of vaporization
ΔvapH (kJ/mol) | Temperature (K) | Method | Reference | Comment |
---|---|---|---|---|
33.2 | 300. | A | Stephenson and Malanowski, 1987 | Based on data from 285. to 343. K.; AC |

Reaction thermochemistry data

Data compiled by: Hussein Y. Afeefy, Joel F. Liebman, and Stephen E. Stein
Individual Reactions
By formula: C4H8Cl2 = C4H7Cl + HCl
Quantity | Value | Units | Method | Reference | Comment |
---|---|---|---|---|---|
ΔrH° | 64.6 ± 2.4 | kJ/mol | Cm | Levanova, Rozhnov, et al., 1975 | gas phase; Dehydrohalogenation |

Kovats' RI, non-polar column, isothermal

Column type | Active phase | Temperature (C) | I | Reference | Comment |
---|---|---|---|---|---|
Packed | Squalane | 110. | 601. | Engewald, Mai, et al., 1976 | N2, Chromosorb W (60-80 mesh); Column length: 3. m |

References

Aldrich Chemical Company Inc., 1990
Aldrich Chemical Company Inc.,
Catalog Handbook of Fine Chemicals, Aldrich Chemical Company, Inc., Milwaukee WI, 1990, 1. [all data]
Kirrmann, 1948
Kirrmann, A.,
Bull. Soc. Chim. Fr., 1948, 1948, 163. [all data]
Burgin, Hearne. G., et al., 1941
Burgin, J.; Hearne. G.; Rust,
Ind. Eng. Chem., 1941, 33, 385. [all data]
Stephenson and Malanowski, 1987
Stephenson, Richard M.; Malanowski, Stanislaw,
Handbook of the Thermodynamics of Organic Compounds, 1987, https://doi.org/10.1007/978-94-009-3173-2
. [all data]
Levanova, Rozhnov, et al., 1975
Levanova, S.V.; Rozhnov, A.M.; Plaksina, T.V.; Anisimova, Z.I.,
Dehydrohalogenation of some dihalo derivatives of isobutane,
Russ. J. Phys. Chem. (Engl. Transl.), 1975, 49, 1440-1441. [all data]
Engewald, Mai, et al., 1976
Engewald, V.W.; Mai, H.; Mühlstädt, M.,
Gaschromatographische Charakterisierung von Chlorierungs-produkten des Isobutens,
J. Prakt. Chem., 1976, 318, 4, 565-574, https://doi.org/10.1002/prac.19763180405
. [all data]