Heptanoic acid, octyl ester
- Formula: C15H30O2
- Molecular weight: 242.3975
- IUPAC Standard InChIKey: XAZROQGRFWCMBU-UHFFFAOYSA-N
- CAS Registry Number: 5132-75-2
- Chemical structure:
View 3d structure (requires JavaScript / HTML 5) - Other names: octyl heptanoate

Phase change data

Data compiled by: Thermodynamics Research Center, NIST Boulder Laboratories, Chris Muzny director
Quantity | Value | Units | Method | Reference | Comment |
---|---|---|---|---|---|
Tboil | 563.90 | K | N/A | Bilterys and Gisseleire, 1935 | Uncertainty assigned by TRC = 1. K |
Tboil | 563.6 | K | N/A | Gartenmeister, 1886 | Uncertainty assigned by TRC = 5. K |
Quantity | Value | Units | Method | Reference | Comment |
Tfus | 251.7 | K | N/A | Bilterys and Gisseleire, 1935 | Uncertainty assigned by TRC = 1. K |

References

Bilterys and Gisseleire, 1935
Bilterys, R.; Gisseleire, J.,
Investigations on the Congelation Temperature of Organic Compounds,
Bull. Soc. Chim. Belg., 1935, 44, 567. [all data]
Gartenmeister, 1886
Gartenmeister, R.,
Investigation of the physical characterstics of liquid compounds: vi boiling point and specific volume of normal fatty acid esters,
Justus Liebigs Ann. Chem., 1886, 233, 249-315. [all data]