Eudesmol
- Formula: C15H24O
- Molecular weight: 220.3505
- IUPAC Standard InChIKey: IGDPRNLDNSDIJI-GWIFJHRUSA-N
- CAS Registry Number: 51317-08-9
- Chemical structure:
View 3d structure (requires JavaScript / HTML 5) - Other names: 2-Naphthalenemethanol, decahydro-α,α,4a,8-tetramethyl-, didehydro deriv., [2R-(2α,4aα,8aβ)]-

Van Den Dool and Kratz RI, non-polar column, temperature ramp

Column type | Active phase | I | Reference | Comment |
---|---|---|---|---|
Capillary | DB-5 | 1652. | Isidorov, Zenkevich, et al., 2001 | He, 3. K/min; Column length: 30. m; Column diameter: 0.25 mm; Tstart: 50. C; Tend: 250. C |
Capillary | OV-101 | 1644. | Yang, Sugisawa, et al., 1992 | N2, 2. K/min; Column length: 50. m; Column diameter: 0.25 mm; Tstart: 80. C; Tend: 200. C |
Capillary | OV-101 | 1644. | Yang, Sugisawa, et al., 1992 | N2, 2. K/min; Column length: 50. m; Column diameter: 0.25 mm; Tstart: 80. C; Tend: 200. C |

Normal alkane RI, non-polar column, temperature ramp

Column type | Active phase | I | Reference | Comment |
---|---|---|---|---|
Capillary | DB-1 | 1619. | Khajeh, Yamini, et al., 2005 | 60. m/0.25 mm/0.25 μm, He, 50. C @ 5. min, 4. K/min; Tend: 250. C |
Capillary | HP-5MS | 1654. | Petrakis, Roussis, et al., 2005 | 3. K/min; Column length: 30. m; Column diameter: 0.2 mm; Tstart: 60. C; Tend: 280. C |
Capillary | DB-5 | 1596. | Simoes-Pires C.A., Debenedetti S., et al., 2005 | 30. m/0.25 mm/0.25 μm, He, 3. K/min; Tstart: 60. C; Tend: 300. C |
Capillary | HP-5MS | 1655. | Vichi, Riu-Aumatell, et al., 2005 | 30. m/0.25 mm/0.25 μm, 40. C @ 5. min, 3. K/min, 220. C @ 10. min |
Capillary | DB-5 | 1602. | Limberger, Sobral, et al., 2004 | 30. m/0.25 mm/0.25 μm, He, 3. K/min; Tstart: 60. C; Tend: 300. C |
Capillary | DB-1 | 1646. | Choi, 2003 | 60. m/0.25 mm/0.25 μm, He, 70. C @ 2. min, 2. K/min, 230. C @ 20. min |
Capillary | HP-5 | 1630. | Stashenko, Jaramillo, et al., 2003 | 60. m/0.25 mm/0.25 μm, 40. C @ 15. min, 5. K/min; Tend: 250. C |
Capillary | DB-5 | 1600. | Limberger, Simões-Pires, et al., 2002 | 30. m/0.25 mm/0.25 μm, He, 3. K/min; Tstart: 60. C; Tend: 250. C |
Capillary | OV-101 | 1644. | Yang, 2001 | N2, 2. K/min; Column length: 50. m; Column diameter: 0.25 mm; Tstart: 80. C; Tend: 200. C |
Capillary | OV-101 | 1644. | Yang, 2001, 2 | N2, 2. K/min; Column length: 50. m; Column diameter: 0.25 mm; Tstart: 80. C; Tend: 200. C |
Capillary | OV-101 | 1644. | Tamura, Yang, et al., 1993 | 2. K/min; Column length: 50. m; Column diameter: 0.25 mm; Tstart: 80. C; Tend: 200. C |
Capillary | OV-101 | 1644. | Tamura, Yang, et al., 1993 | 2. K/min; Column length: 50. m; Column diameter: 0.25 mm; Tstart: 80. C; Tend: 200. C |
Capillary | OV-101 | 1636. | Yang and Sugisawa, 1990 | N2, 2. K/min; Column length: 50. m; Column diameter: 0.25 mm; Tstart: 80. C; Tend: 200. C |
Capillary | OV-101 | 1644. | Yang and Sugisawa, 1990 | N2, 2. K/min; Column length: 50. m; Column diameter: 0.25 mm; Tstart: 80. C; Tend: 200. C |
Capillary | OV-101 | 1636. | Sugisawa, Yang, et al., 1989 | N2, 2. K/min; Column length: 50. m; Column diameter: 0.25 mm; Tstart: 80. C; Tend: 200. C |
Capillary | OV-101 | 1647. | Sugisawa, Yang, et al., 1989 | N2, 2. K/min; Column length: 50. m; Column diameter: 0.25 mm; Tstart: 80. C; Tend: 200. C |

Normal alkane RI, non-polar column, custom temperature program

Column type | Active phase | I | Reference | Comment |
---|---|---|---|---|
Capillary | HP-5 MS | 1650. | Stokes, Cole, et al., 2007 | Program: not specified |
Capillary | HP-5MS | 1614. | Yu, Huang, et al., 2007 | 30. m/0.25 mm/0.25 μm, He; Program: 40C(3min) => 6C/min => 160C => 10C/min => 300C (10min) |
Capillary | CP Sil 8 CB | 1622. | Judpentienë and Mockutë, 2004 | He; Column length: 50. m; Column diameter: 0.32 mm; Program: 60C(2min) => 5C/min => 160C (1min) => 10C/min => 250C (2min) |
Capillary | DB-5 | 1649. | Isidorov, Zenkevich, et al., 2001 | He; Column length: 30. m; Column diameter: 0.25 mm; Program: not specified |
Capillary | DB-5 | 1650. | Petrakis, Tsitsimpikou, et al., 2001 | Program: not specified |
Capillary | OV-101 | 1644. | Yang, 2001 | N2; Column length: 50. m; Column diameter: 0.25 mm; Program: not specified |

Normal alkane RI, polar column, temperature ramp

Column type | Active phase | I | Reference | Comment |
---|---|---|---|---|
Capillary | Carbowax | 2266. | Singh, Kumar, et al., 2007 | 60. m/0.25 mm/0.25 μm, He, 5. K/min; Tstart: 40. C; Tend: 180. C |
Capillary | Supelcowax-10 | 2203. | Vichi, Riu-Aumatell, et al., 2005 | 30. m/0.25 mm/0.25 μm, 40. C @ 5. min, 3. K/min, 220. C @ 10. min |
Capillary | HP-Innowax | 2240. | Stashenko, Jaramillo, et al., 2003 | 50. m/0.2 mm/0.2 μm, 50. C @ 5. min, 4. K/min; Tend: 220. C |

References

Isidorov, Zenkevich, et al., 2001
Isidorov, V.A.; Zenkevich, I.G.; Krajewska, U.; Dubis, E.N.; Jaroszynska, J.; Bal, K.,
Gas chromatographic analysis of essential oils with preliminary partition of components,
Phytochem. Anal., 2001, 12, 2, 87-90, https://doi.org/10.1002/pca.564
. [all data]
Yang, Sugisawa, et al., 1992
Yang, R.; Sugisawa, H.; Nakatani, H.; Tamura, H.; Takagi, N.,
Comparison of odor quality in peel oils of acid citrus,
Nippon Shokuhin Kogyo Gakkaishi, 1992, 39, 1, 16-24, https://doi.org/10.3136/nskkk1962.39.16
. [all data]
Khajeh, Yamini, et al., 2005
Khajeh, M.; Yamini, Y.; Bahramifar, N.; Sefidkon, F.; Reza Pirmoradei, M.,
Comparison of essential oils compositions of Ferula assa-foetida obtained by supercritical carbon dioxide extraction and hydrodistillation methods,
Food Chem., 2005, 91, 4, 639-644, https://doi.org/10.1016/j.foodchem.2004.06.033
. [all data]
Petrakis, Roussis, et al., 2005
Petrakis, P.V.; Roussis, V.; Papadimitriou, D.; Vagias, C.; Tsitsimpikou, C.,
The effect of terpenoid extracts from 15 pine species on the feeding behavioural sequence of the late instars of the pine processionary caterpillar Thaumetopoea pityocampa,
Behav. Processes, 2005, 69, 3, 303-322, https://doi.org/10.1016/j.beproc.2004.12.008
. [all data]
Simoes-Pires C.A., Debenedetti S., et al., 2005
Simoes-Pires C.A.; Debenedetti S.; Spegazzini E.; Mentz L.A.; Matzenbacher N.I.; Limberger R.P.; Henriques A.T.,
Investigation of the essential oil from eight species of Baccharis belonging to sect. Caulopterae (Asteraceae, Astereae): a taxonomic approach,
Plant Systematics and Evolution, 2005, 253, 1-4, 23-32, https://doi.org/10.1007/s00606-005-0296-6
. [all data]
Vichi, Riu-Aumatell, et al., 2005
Vichi, S.; Riu-Aumatell, M.; Mora-Pons, M.; Buxaderas, S.; Lopez-Tamames, E.,
Characterization of Volatiles in Different Dry Gins,
J. Agric. Food Chem., 2005, 53, 26, 10154-10160, https://doi.org/10.1021/jf058121b
. [all data]
Limberger, Sobral, et al., 2004
Limberger, R.P.; Sobral, M.; Henriques, A.T.; Menut, C.; Bessière, J.-M.,
Óleos voláteis de espécies de Myrcia nativas do rio grande do sul,
Quim. Nova, 2004, 27, 6, 916-919, https://doi.org/10.1590/S0100-40422004000600015
. [all data]
Choi, 2003
Choi, H.-S.,
Characterization of citrus unshiu (C. unshiu Marcov. forma Miyagawa-wase) blossom aroma by solid-phase microextraction in conjunction with an electronic nose,
J. Agric. Food Chem., 2003, 51, 2, 418-423, https://doi.org/10.1021/jf0114280
. [all data]
Stashenko, Jaramillo, et al., 2003
Stashenko, E.E.; Jaramillo, B.E.; Martínez, J.R.,
Comparación de la composición química y de la actividad antioxidante in vitro de los metabolitos secundarios volátiles de plantas de la familia verbenaceae,
Rev. Acad. Colomb. Cienc. Exactas Fis. Nat., 2003, 27, 105, 579-597. [all data]
Limberger, Simões-Pires, et al., 2002
Limberger, R.P.; Simões-Pires, C.; Sobral, M.; Menu, C.; Bessiere, J.-M.; Henriques, A.T.,
Essential oils from some Myrceugenia species (Myrtaceae),
Flavour Fragr. J., 2002, 17, 5, 341-344, https://doi.org/10.1002/ffj.1113
. [all data]
Yang, 2001
Yang, R.,
Analysis of the volatile components in peel oil of Yuzu by gas chromatography/mass spectrometry,
Chin. J. Anal. Chem., 2001, 29, 3, 313-316. [all data]
Yang, 2001, 2
Yang, R.,
Volatile compounds in peel oil of Citrus sudachi,
Food Sci. (Beijing), 2001, 22, 3, 71-73. [all data]
Tamura, Yang, et al., 1993
Tamura, H.; Yang, R.-H.; Sugisawa, H.,
Aroma profiles of peel oils of acid citrus,
ACS Sym. Ser., 1993, 525, 121-136. [all data]
Yang and Sugisawa, 1990
Yang, R.; Sugisawa, H.,
Citrus Suachi Hort. ex Shirai. Volatile components in Sudachi (Citrus Sudachi Hort. ex Shirai) juice,
Nippon Shokuhin Kogyo Gakkaishi, 1990, 37, 12, 946-952, https://doi.org/10.3136/nskkk1962.37.12_946
. [all data]
Sugisawa, Yang, et al., 1989
Sugisawa, H.; Yang, R.H.; Kawabata, C.; Tamura, H.,
Volatile constituents in the peel oil of sudachi (Citrus sudachi),
Agric. Biol. Chem., 1989, 53, 6, 1721-1723, https://doi.org/10.1271/bbb1961.53.1721
. [all data]
Stokes, Cole, et al., 2007
Stokes, S.L.; Cole, R.A.; Rangelova, M.P.; Haber, W.A.; Setzer, W.N.,
Cruzain inhibitory activity of the leaf essential oil from an undescribed species of Eugenia from Monteverde, Costa Rica,
Natural Product Communications, 2007, 2, 12, 1211-1213. [all data]
Yu, Huang, et al., 2007
Yu, Y.; Huang, T.; Yang, B.; Liu, X.; Duan, G.,
Development of gas chromatography-mass spectrometry with microwave distillation and simultaneous solid-phase microextraction for rapid determination of volatile constituents in ginger,
J. Pharm. Biomed. Anal., 2007, 43, 1, 24-31, https://doi.org/10.1016/j.jpba.2006.06.037
. [all data]
Judpentienë and Mockutë, 2004
Judpentienë, A.; Mockutë, D.,
Chemical composition of essential oils produced by pink flower inflorescences of wild Achillea millefolium L.,
Chemija, 2004, 15, 28-32. [all data]
Petrakis, Tsitsimpikou, et al., 2001
Petrakis, P.V.; Tsitsimpikou, C.; Tzakou, O.; Couladis, M.; Vagias, C.; Roussis, V.,
Needle volatiles from five Pinus species growing in Greece,
Flavour Fragr. J., 2001, 16, 4, 249-252, https://doi.org/10.1002/ffj.990
. [all data]
Singh, Kumar, et al., 2007
Singh, B.; Kumar, R.; Bhandari, S.; Pathania, S.; Lal, B.,
Volatile constituents of natural Boswellia serrata oleo-gum-resin and commercial samples,
Flavour Fragr. J., 2007, 22, 2, 145-147, https://doi.org/10.1002/ffj.1772
. [all data]