Ditalimfos
- Formula: C12H14NO4PS
- Molecular weight: 299.283
- IUPAC Standard InChIKey: MTBZIGHNGSTDJV-UHFFFAOYSA-N
- CAS Registry Number: 5131-24-8
- Chemical structure:
View 3d structure (requires JavaScript / HTML 5) - Other names: O,O-Diethyl phthalimidophosphonothioate; Phosphonothioic acid, (1,3-dihydro-1,3-dioxo-2H-isoindol-2-yl)-, O,O-diethyl ester; Phosphonothioic acid, phthalimido-, O,O-diethyl ester; Dowco 199; M 2452; Millie; O 199; O,O-Diethyl phthalimidophosphonothionate; Ortho 199; Phthalimide, N-(diethoxyphosphinothioyl)-; Plondrel; O,O-Diaethyl-N-phtalimido-thiophosphat; O,O-Diethyl phthalimidothiophosphate; Ditalimphos; Laptran; Diethyl phthalimidophosphonothioate; O,O-Diethyl (1,3-dihydro-1,3-dioxo-2H-isoindol-2-yl)phosphonothioate; RE 199; SF 101

Phase change data

Data compiled by: Thermodynamics Research Center, NIST Boulder Laboratories, Chris Muzny director
Quantity | Value | Units | Method | Reference | Comment |
---|---|---|---|---|---|
Tfus | 357.88 | K | N/A | Donnelly, Drewes, et al., 1990 | Uncertainty assigned by TRC = 0.2 K |

Van Den Dool and Kratz RI, non-polar column, temperature ramp

Column type | Active phase | I | Reference | Comment |
---|---|---|---|---|
Capillary | SLB-5MS | 2128. | Mondello, Casilli, et al., 2007 | 30. m/0.25 mm/0.25 μm, He, 2. K/min; Tstart: 70. C; Tend: 300. C |
Capillary | SLB-5MS | 2137. | Mondello, Casilli, et al., 2007 | 30. m/0.25 mm/0.25 μm, He, 2. K/min; Tstart: 70. C; Tend: 300. C |

References

Donnelly, Drewes, et al., 1990
Donnelly, J.R.; Drewes, L.A.; Johnson, R.L.; Munslow, W.D.; Knapp, K.K.; Sovocool, G.W.,
Purity and heat of fusion data for environmental standards as determined by differential scanning calorimetry,
Thermochim. Acta, 1990, 167, 2, 155, https://doi.org/10.1016/0040-6031(90)80476-F
. [all data]
Mondello, Casilli, et al., 2007
Mondello, L.; Casilli, A.; Tranchida, P.Q.; Presti, M.L.; Dugo, P.; Dugo, G.,
Comprehensive gas chromatography coupled to mass spectrometry for the separation of pesticides in a very complex matrix,
Anal. Bioanal. Chem., 2007, 389, 6, 1755-1763, https://doi.org/10.1007/s00216-007-1412-y
. [all data]