tert-C4H9C(O)OCH(CH3)2
- Formula: C8H16O2
- Molecular weight: 144.2114
- IUPAC Standard InChIKey: PMFKTHJAJBPRNM-UHFFFAOYSA-N
- CAS Registry Number: 5129-36-2
- Chemical structure:
View 3d structure (requires JavaScript / HTML 5) - Other names: 2,2-Dimethylpropionic acid, isopropyl ester; iso-Propyl pivalate; Propanoic acid, 2,2-dimethyl, 1-methylethyl ester

Phase change data

Data compiled as indicated in comments:
TRC - Thermodynamics Research Center, NIST Boulder Laboratories, Chris Muzny director
ALS - Hussein Y. Afeefy, Joel F. Liebman, and Stephen E. Stein
Quantity | Value | Units | Method | Reference | Comment |
---|---|---|---|---|---|
Tboil | 401. | K | N/A | Staab and Mannschrek, 1962 | Uncertainty assigned by TRC = 3. K; TRC |
Quantity | Value | Units | Method | Reference | Comment |
ΔvapH° | 4828. | kJ/mol | C | Pawlenko, 1963 | ALS |

References

Staab and Mannschrek, 1962
Staab, H.A.; Mannschrek, A.,
Synthesis of Carboxylic Acid Esters by the Imadazolide Method,
Chem. Ber., 1962, 95, 1284-97. [all data]
Pawlenko, 1963
Pawlenko, S.,
Kennzahlen und IR-Spektren Einiger Pivalinsaureester,
Liebigs Ann. Chem., 1963, 663, 8-11. [all data]