5,9-Tetradecadiyne
- Formula: C14H22
- Molecular weight: 190.3245
- IUPAC Standard InChIKey: MYMVMGJYNYKGGP-UHFFFAOYSA-N
- CAS Registry Number: 51255-61-9
- Chemical structure:
View 3d structure (requires JavaScript / HTML 5) - Permanent link for this species. Use this link for bookmarking this species for future reference.

Phase change data

Data compiled by: Robert L. Brown and Stephen E. Stein
Reduced pressure boiling point
Tboil (K) | Pressure (bar) | Reference |
---|---|---|
405. to 407. | 0.016 | Farchan Laboratories, 1990 |

References

Farchan Laboratories, 1990
Farchan Laboratories,
Research Chemicals Catalog, Farchan Laboratories, Gainesville, FL, 1990, 91. [all data]