Valdetamide
- Formula: C9H17NO
- Molecular weight: 155.2374
- IUPAC Standard InChIKey: LOMDVEFCNVDZMZ-UHFFFAOYSA-N
- CAS Registry Number: 512-48-1
- Chemical structure:
View 3d structure (requires JavaScript / HTML 5) - Other names: 4-Pentenamide, 2,2-diethyl-; Diethylallylacetamide; Epinoval; Novonal; 2,2-Diethyl-4-pentenamide; Allyldiethylacetamide

Kovats' RI, non-polar column, temperature ramp

Column type | Active phase | I | Reference | Comment |
---|---|---|---|---|
Packed | SE-30 | 1285. | Maurer, 1990 | N2, 100. C @ 3. min, 30. K/min, 310. C @ 5. min |

References

Maurer, 1990
Maurer, H.H.,
Identification and differentiation of barbiturates, other sedative-hypnotics and their metabolites in urine integrated in a general screening procedure using computerized gas chromatography-mass spectrometry,
J. Chromatogr., 1990, 530, 307-326, https://doi.org/10.1016/S0378-4347(00)82334-8
. [all data]