2,2',3,3',4,5,5',6,6'-nonachloro-1,1'-biphenyl

Phase change data

Data compiled by: Thermodynamics Research Center, NIST Boulder Laboratories, Chris Muzny director

Quantity Value Units Method Reference Comment
Tfus455.8KN/AMiller, Ghodbane, et al., 1984Uncertainty assigned by TRC = 0.2 K

In addition to the Thermodynamics Research Center (TRC) data available from this site, much more physical and chemical property data is available from the following TRC products:

References

Miller, Ghodbane, et al., 1984
Miller, M.M.; Ghodbane, S.; Wasik, S.P.; Tewari, Y.B.; Martire, D.E., Aqueous Solubilities, Octanol/Water Partition Coefficients, and Entropies of Melting of Chlorinated Benzenes and Biphenyls, J. Chem. Eng. Data, 1984, 29, 184-190. [all data]