2,3,7,8-Tetrachlorodibenzofuran
- Formula: C12H4Cl4O
- Molecular weight: 305.972
- IUPAC Standard InChIKey: KSMVNVHUTQZITP-UHFFFAOYSA-N
- CAS Registry Number: 51207-31-9
- Chemical structure:
View 3d structure (requires JavaScript / HTML 5) - Other names: Dibenzofuran, 2,3,7,8-tetrachloro-; NCI-C56611; 2,3,7,8-Tetrapolychlorinated dibenzofuran; TCDF

Phase change data

Data compiled by: William E. Acree, Jr., James S. Chickos
Enthalpy of sublimation
ΔsubH (kJ/mol) | Temperature (K) | Method | Reference | Comment |
---|---|---|---|---|
124. | 323. | T | Rordorf, 1989 | Based on data from 303. to 344. K. See also Rordorf, 1986. |

Kovats' RI, non-polar column, isothermal

View large format table.

Column type Active phase Temperature (C) I Reference Comment
CapillaryOV-1240.2309.Shomburg G., Husmann H., et al., 1985Column length: 25. m; Column diameter: 0.25 mm

Van Den Dool and Kratz RI, non-polar column, temperature ramp

View large format table.

Column type Active phase I Reference Comment
CapillaryDB-52338.Hale, Hileman, et al., 1985He, 175. C @ 1. min, 6. K/min; Column length: 30. m; Tend: 180. C

Van Den Dool and Kratz RI, non-polar column, custom temperature program

View large format table.

Column type Active phase I Reference Comment
CapillaryHP-52324.Korhonen and Mantykoski, 198925. m/0.20 mm/0.11 μm, He; Program: 100 0C (1 min) 20 0C/min -> 180 0C 5 0C/min -> 290 0C (until elution of the last peak)
CapillaryHP-52342.Korhonen and Mantykoski, 198925. m/0.20 mm/0.11 μm, He; Program: 100 0C (1 min) 20 0C/min -> 180 0C 5 0C/min -> 290 0C (until elution of the last peak)

Normal alkane RI, non-polar column, custom temperature program

View large format table.

Column type Active phase I Reference Comment
CapillaryDB-52338.N/AProgram: not specified

References

Rordorf, 1989
Rordorf, Berchtold F.,
Prediction of vapor pressures, boiling points and enthalpies of fusion for twenty-nine halogenated dibenzo-p-dioxins and fifty-five dibenzofurans by a vapor pressure correlation method,
Chemosphere, 1989, 18, 1-6, 783-788, https://doi.org/10.1016/0045-6535(89)90196-3
. [all data]
Rordorf, 1986
Rordorf, Berchtold F.,
Thermal properties of dioxins, furans and related compounds,
Chemosphere, 1986, 15, 9-12, 1325-1332, https://doi.org/10.1016/0045-6535(86)90407-8
. [all data]