2,4-dimethyl-3-(1-methylethyl)-3-pentanol
- Formula: C10H22O
- Molecular weight: 158.2811
- IUPAC Standard InChIKey: IFXNWIUSZUHIDG-UHFFFAOYSA-N
- CAS Registry Number: 51200-83-0
- Chemical structure:
View 3d structure (requires JavaScript / HTML 5) - Permanent link for this species. Use this link for bookmarking this species for future reference.

Phase change data

Data compiled by: Thermodynamics Research Center, NIST Boulder Laboratories, Chris Muzny director
Quantity | Value | Units | Method | Reference | Comment |
---|---|---|---|---|---|
Tboil | 467.65 | K | N/A | Howard, Mears, et al., 1947 | Uncertainty assigned by TRC = 0.3 K |
Quantity | Value | Units | Method | Reference | Comment |
Tfus | 258.45 | K | N/A | Howard, Mears, et al., 1947 | Uncertainty assigned by TRC = 0.2 K |
Tfus | 266. | K | N/A | Young and Roberts, 1944 | Uncertainty assigned by TRC = 3. K |

References

Howard, Mears, et al., 1947
Howard, F.L.; Mears, T.W.; Fookson, A.; Pomerantz, P.; Brooks, D.B.,
Preparation and physical properties of several aliphatic hydrocarbons and intermediates,
J. Res. Natl. Bur. Stand. (U. S.), 1947, 38, 365. [all data]
Young and Roberts, 1944
Young, W.G.; Roberts, J.D.,
Highly-Branched Compounds. The Preparation of Triisopropylcarbinol and Diisopropyl-s-butylcarbinol,
J. Am. Chem. Soc., 1944, 66, 1444. [all data]