4-isopropyl-4-heptanol

Phase change data

Data compiled by: Thermodynamics Research Center, NIST Boulder Laboratories, Chris Muzny director

Quantity Value Units Method Reference Comment
Tboil462.15KN/AStas, 1926Uncertainty assigned by TRC = 5. K

In addition to the Thermodynamics Research Center (TRC) data available from this site, much more physical and chemical property data is available from the following TRC products:

References

Stas, 1926
Stas, J., Bull. Soc. Chim. Belg., 1926, 35, 379-86. [all data]