1,3-Butadiene, 1-chloro-3-methyl-
- Formula: C5H7Cl
- Molecular weight: 102.562
- IUPAC Standard InChIKey: RHCFCHADDXGWJE-ONEGZZNKSA-N
- CAS Registry Number: 51034-46-9
- Chemical structure:
View 3d structure (requires JavaScript / HTML 5) - Permanent link for this species. Use this link for bookmarking this species for future reference.

Normal alkane RI, non-polar column, temperature ramp

Column type | Active phase | I | Reference | Comment |
---|---|---|---|---|
Capillary | OV-101 | 696. | Zenkevich, 2005 | 25. m/0.20 mm/0.10 μm, N2/He, 6. K/min; Tstart: 50. C; Tend: 250. C |

References

Zenkevich, 2005
Zenkevich, I.G.,
Experimentally measured retention indices., 2005. [all data]