Glucose
- Formula: C6H12O6
- Molecular weight: 180.1559
- IUPAC Standard InChIKey: GZCGUPFRVQAUEE-SLPGGIOYSA-N
- CAS Registry Number: 50-99-7
- Chemical structure:
View 3d structure (requires JavaScript / HTML 5) - Stereoisomers:
- Other names: D-Glucose; Anhydrous dextrose; Cartose; Cerelose; Corn sugar; D-(+)-Glucose; Dextropur; Dextrose; Dextrosol; Glucolin; Grape sugar; Sugar, grape; D-Glucose, anhydrous; Dextrose, anhydrous; Glucose (D); Glucose, anhydrous; Glucose liquid; Blood sugar; Roferose ST; Cerelose 2001; Glucosteril; Goldsugar; Maxim Energy Gel; Staleydex 111; Staleydex 333; Tabfine 097(HS); Vadex; (+)-Glucose
- Comments:
- Although only a single structure is shown, this species may exist in several forms including a linear molecule, a five membered ring and a six membered ring.

Phase change data

Data compiled by: Thermodynamics Research Center, NIST Boulder Laboratories, Chris Muzny director
Quantity | Value | Units | Method | Reference | Comment |
---|---|---|---|---|---|
Tfus | 423. | K | N/A | Kofler and Sitte, 1950 | Uncertainty assigned by TRC = 3. K; With "hot stage" |
Tfus | 420. | K | N/A | Kofler and Sitte, 1950 | Uncertainty assigned by TRC = 4. K; By "differntial thermal absorption" |
Tfus | 414. | K | N/A | Parks and Thomas, 1934 | Uncertainty assigned by TRC = 2. K |

Reaction thermochemistry data

Data compiled by: Robert C. Dunbar
Individual Reactions
By formula: Na+ + C6H12O6 = (Na+ • C6H12O6)
Quantity | Value | Units | Method | Reference | Comment |
---|---|---|---|---|---|
ΔrH° | 174. | kJ/mol | CIDC | Cerda and Wesdemiotis, 1999 |
Free energy of reaction
ΔrG° (kJ/mol) | T (K) | Method | Reference |
---|---|---|---|
0.0 | 298. | CIDC | Cerda and Wesdemiotis, 1999 |

Ion clustering data

Data compiled by: Robert C. Dunbar
Clustering reactions
By formula: Na+ + C6H12O6 = (Na+ • C6H12O6)
Quantity | Value | Units | Method | Reference | Comment |
---|---|---|---|---|---|
ΔrH° | 174. | kJ/mol | CIDC | Cerda and Wesdemiotis, 1999 |
Free energy of reaction
ΔrG° (kJ/mol) | T (K) | Method | Reference |
---|---|---|---|
0.0 | 298. | CIDC | Cerda and Wesdemiotis, 1999 |

References

Kofler and Sitte, 1950
Kofler, L.; Sitte, H.,
Melting Point Determination of Substances with Melt with Decomposition,
Monatsh. Chem., 1950, 81, 619. [all data]
Parks and Thomas, 1934
Parks, G.S.; Thomas, S.B.,
The heat capacities of crystalline, glassy and undercooled liquid glucose,
J. Am. Chem. Soc., 1934, 56, 1423. [all data]
Cerda and Wesdemiotis, 1999
Cerda, B.A.; Wesdemiotis, C.,
Thermochemistry and Structures of Na+ Coordinated Mono- and Disaccharide Stereoisomers,
Int. J. Mass Spectrom., 1999, 189, 2-3, 189, https://doi.org/10.1016/S1387-3806(99)00085-8
. [all data]