2,3,4,4-tetramethyl-1-pentene
- Formula: C9H18
- Molecular weight: 126.2392
- IUPAC Standard InChIKey: UFYWELWPOZYDED-UHFFFAOYSA-N
- CAS Registry Number: 50987-59-2
- Chemical structure:
View 3d structure (requires JavaScript / HTML 5) - Permanent link for this species. Use this link for bookmarking this species for future reference.

Phase change data

Data compiled by: Thermodynamics Research Center, NIST Boulder Laboratories, Chris Muzny director
Quantity | Value | Units | Method | Reference | Comment |
---|---|---|---|---|---|
Tboil | 403.2 | K | N/A | Kharasch, Liu, et al., 1954 | Uncertainty assigned by TRC = 4. K |
Tboil | 401.12 | K | N/A | Pomerantz, Mears, et al., 1949 | Uncertainty assigned by TRC = 0.3 K |
Tboil | 401.0 | K | N/A | Miller and Lovell, 1948 | Uncertainty assigned by TRC = 1. K |
Tboil | 406. | K | N/A | Whitmore and Mosher, 1941 | Uncertainty assigned by TRC = 5. K |
Tboil | 406. | K | N/A | Mosher, 1940 | Uncertainty assigned by TRC = 4. K |

References

Kharasch, Liu, et al., 1954
Kharasch, M.S.; Liu, Y.-C.; Nudenberg, W.,
Reactions of Atoms and Free Radicals in Solution XXXV. Migration of a Methyl Group in the Rearrangement of the Fre Di-tert-butylcarbinyl Radical. The Reaction of dDi-tert-butylcarbinyl CHloride with,
J. Org. Chem., 1954, 19, 1150. [all data]
Pomerantz, Mears, et al., 1949
Pomerantz, P.; Mears, T.W.; Howard, F.L.,
Separation and Identification of the Major C1 to C10 Components of Triptene Residue,
J. Res. Natl. Bur. Stand. (U. S.), 1949, 42, 617-32. [all data]
Miller and Lovell, 1948
Miller, V.A.; Lovell, W.G.,
Ind. Eng. Chem., 1948, 40, 1138. [all data]
Whitmore and Mosher, 1941
Whitmore, F.C.; Mosher, W.A.,
J. Am. Chem. Soc., 1941, 63, 1120. [all data]
Mosher, 1940
Mosher, W.A.,
, Ph.D. Dissertation, Penn. State Univ., Univ. Park, 1940. [all data]