Oxy-p,p'-dibenzoyl chloride
- Formula: C14H8Cl2O3
- Molecular weight: 295.118
- CAS Registry Number: 50975-64-9

Condensed phase thermochemistry data

Data compiled by: Eugene S. Domalski and Elizabeth D. Hearing
Quantity | Value | Units | Method | Reference | Comment |
---|---|---|---|---|---|
S°solid,1 bar | 312.3 | J/mol*K | N/A | Sapozhnikov and Mochalov, 1973 |
Constant pressure heat capacity of solid
Cp,solid (J/mol*K) | Temperature (K) | Reference | Comment |
---|---|---|---|
308.1 | 300. | Sapozhnikov and Mochalov, 1973 | T = 20 to 300 K. |

References

Sapozhnikov and Mochalov, 1973
Sapozhnikov, V.N.; Mochalov, A.N.,
Karyakin, N.V. Kunyavskaya, S.G., Chernova, V.I., and Rabinovich, I.B.,
Low-temperature heat capacity and thermodynamic properties of some acid dichlorides, 1973, Tr. [all data]