C6H20Si3

Reaction thermochemistry data

Data compiled by: John E. Bartmess

Individual Reactions

C6H19Si3- + Hydrogen cation = C6H20Si3

By formula: C6H19Si3- + H+ = C6H20Si3

Quantity Value Units Method Reference Comment
Δr1477. ± 18.kJ/molD-EABrinkman, Berger, et al., 1994gas phase; BDE revised, based on data for DH of (Me3Si)3Si-H in Laarhoven, Mulder, et al., 1999

References

Brinkman, Berger, et al., 1994
Brinkman, E.A.; Berger, S.; Brauman, J.I., alpha-Silyl-substituent stabilization of carbanions and silyl anions, J. Am. Chem. Soc., 1994, 116, 18, 8304, https://doi.org/10.1021/ja00097a042 . [all data]

Laarhoven, Mulder, et al., 1999
Laarhoven, L.J.J.; Mulder, P.; Wayner, D.D.M., Determination of bond dissociation enthalpies in solution by photoacoustic calorimetry, Acc. Chem. Res., 1999, 32, 4, 342-349, https://doi.org/10.1021/ar9703443 . [all data]