Cyclohexane, 1,1,3,5-tetramethyl-, cis-
- Formula: C10H20
- Molecular weight: 140.2658
- IUPAC Standard InChIKey: WOJSMJIXPQLESQ-DTORHVGOSA-N
- CAS Registry Number: 50876-32-9
- Chemical structure:
View 3d structure (requires JavaScript / HTML 5) - Stereoisomers:
- Other names: cis-1,1,3,5-Tetramethylcyclohexane; 1,1,3,5-Tetramethylcyclohexane, (Z)-

Phase change data

Data compiled as indicated in comments:
BS - Robert L. Brown and Stephen E. Stein
TRC - Thermodynamics Research Center, NIST Boulder Laboratories, Chris Muzny director
Quantity | Value | Units | Method | Reference | Comment |
---|---|---|---|---|---|
Tboil | 425.7 | K | N/A | Weast and Grasselli, 1989 | BS |
Tboil | 425.11 | K | N/A | Streiff, 1964 | Uncertainty assigned by TRC = 0.2 K; TRC |
Tboil | 425.6 | K | N/A | Chiurdoglu and Maquestiau, 1954 | Uncertainty assigned by TRC = 1. K; TRC |

Kovats' RI, non-polar column, temperature ramp

Column type | Active phase | I | Reference | Comment |
---|---|---|---|---|
Capillary | Apiezon L | 908. | Louis, 1971 | N2, 1. K/min; Column length: 50. m; Column diameter: 0.25 mm; Tstart: 60. C |

References

Weast and Grasselli, 1989
CRC Handbook of Data on Organic Compounds, 2nd Editon, Weast,R.C and Grasselli, J.G., ed(s)., CRC Press, Inc., Boca Raton, FL, 1989, 1. [all data]
Streiff, 1964
Streiff, A.J.,
, Am. Pet. Inst. Res. Proj. 58B Unpublished, 1964. [all data]
Chiurdoglu and Maquestiau, 1954
Chiurdoglu, G.; Maquestiau, A.,
Alicyclic Compounds with a Quaternary Carbon I. Syntheses of Some gem-Polymethylcyclohexanes,
Bull. Soc. Chim. Belg., 1954, 63, 357. [all data]
Louis, 1971
Louis, R.,
Kovats-index-tafeln zur gaschromatographischen analyse von kohlenwasserstoffgemischen,
Erdoel Kohle Erdgas Petrochem., 1971, 24, 2, 88-94. [all data]