2,3-Dimethyl-2-pentanol

Normal alkane RI, polar column, custom temperature program

View large format table.

Column type Active phase I Reference Comment
CapillarySupelcowax1124.Garneau, Bouhajib, et al., 1994Column length: 30. m; Column diameter: 0.25 mm; Program: not specified

References

Garneau, Bouhajib, et al., 1994
Garneau, F.X.; Bouhajib, M.; Collin, G.J.; Gagnon, M.; ApSimon, J.W., The glycosidically bound volatile compounds of Picea mariana (Mill.) B.S.P., J. Essent. Oil Res., 1994, 6, 1, 43-46, https://doi.org/10.1080/10412905.1994.9698323 . [all data]