Borneol
- Formula: C10H18O
- Molecular weight: 154.2493
- IUPAC Standard InChIKey: DTGKSKDOIYIVQL-CCNFQMFXSA-N
- CAS Registry Number: 507-70-0
- Chemical structure:
View 3d structure (requires JavaScript / HTML 5) - Species with the same structure:
- Stereoisomers:
- Other names: Bicyclo[2.2.1]heptan-2-ol, 1,7,7-trimethyl-; endo-Borneol; endo-2-Hydroxy-1,7,7-trimethylnorbornane; Camphol; Bicyclo[2.2.1]heptan-2-ol, 1,7,7-trimethyl-, endo-; 2-Bornanol, endo-; Baros camphor; Bhimsaim camphor; Borneo camphor; trans-Borneol; Bornyl alcohol; Camphane, 2-hydroxy-; 2-Camphanol; Dryobalanops camphor; 2-Hydroxycamphane; Malayan camphor; Sumatra camphor; 1,7,7-Trimethyl-bicyclo(2.2.1)heptan-2-ol, endo-; UN 1312; Bhimsiam camphor; dl-Borneol; Endo-1,7,7-trimethylbicyclo[2.2.1]heptan-2-ol; Endo-2-bornanol; Endo-2-camphanol; Endo-2-hydroxycamphane; Malay camphor; 1,7,7-Trimethylbicyclo[2.2.1]heptan-2-ol; 2-endo-Bornyl alcohol; Camphor

Condensed phase thermochemistry data

Data compiled by: Hussein Y. Afeefy, Joel F. Liebman, and Stephen E. Stein
Quantity | Value | Units | Method | Reference | Comment |
---|---|---|---|---|---|
ΔcH°solid | -6231.2 | kJ/mol | Ccb | Yamada, 1941 | Corresponding ΔfHºsolid = -276. kJ/mol (simple calculation by NIST; no Washburn corrections) |

Phase change data

Data compiled by: Thermodynamics Research Center, NIST Boulder Laboratories, Chris Muzny director
Quantity | Value | Units | Method | Reference | Comment |
---|---|---|---|---|---|
Tboil | 486.4 | K | N/A | Lecat, 1926 | Uncertainty assigned by TRC = 0.5 K |
Quantity | Value | Units | Method | Reference | Comment |
Tfus | 477. | K | N/A | Pirsch, 1932 | Uncertainty assigned by TRC = 2. K |
Tfus | 471. | K | N/A | Buechner, 1906 | Uncertainty assigned by TRC = 2.5 K |

Van Den Dool and Kratz RI, non-polar column, temperature ramp

Data compiled by: NIST Mass Spectrometry Data Center, William E. Wallace, director

Column type CapillaryCapillaryCapillaryCapillaryCapillary
Active phase RTX-1BP-1BP-1DB-5HP-5
Column length (m) 60.50.50.30.30.
Carrier gas HeHeHeHeN2
Substrate
Column diameter (mm) 0.220.220.220.250.25
Phase thickness (μm) 0.250.250.250.250.25
Tstart (C) 60.60.60.60.60.
Tend (C) 230.220.220.240.220.
Heat rate (K/min) 2.2.2.3.5.
Initial hold (min)     10.
Final hold (min) 30.20.20.
I 1148.1148.1149.1167.1167.
ReferenceBendahou, Muselli, et al., 2008Castilho, Liu, et al., 2007Duquesnoy, Castola, et al., 2007Flamini, Cioni, et al., 2007Flamini, Tebano, et al., 2007
Comment MSDC-RI MSDC-RI MSDC-RI MSDC-RI MSDC-RI
Column type CapillaryCapillaryCapillaryCapillaryCapillary
Active phase DB-5HP-5MSBP-1DB-5RTX-1
Column length (m) 30.30.50.30.60.
Carrier gas HeHeHe He
Substrate
Column diameter (mm) 0.250.250.220.220.22
Phase thickness (μm) 0.250.250.250.250.25
Tstart (C) 60.60.60.60.60.
Tend (C) 246.280.220.240.230.
Heat rate (K/min) 3.3.2.3.2.
Initial hold (min)    2.
Final hold (min)   20. 30.
I 1164.1167.1148.1166.1148.
ReferenceHongratanaworakit and Buchbauer, 2007Kundakovic, Fokialakis, et al., 2007Lesueur, de Rocca Serra, et al., 2007Martins, Santos, et al., 2007Muselli, Rossi, et al., 2007
Comment MSDC-RI MSDC-RI MSDC-RI MSDC-RI MSDC-RI
Column type CapillaryCapillaryCapillaryCapillaryCapillary
Active phase Equity-5DB-5ZB-5HP-5MSDB-5
Column length (m) 60.30.30.30.30.
Carrier gas HeHeHeHeHe
Substrate
Column diameter (mm) 0.250.250.250.250.25
Phase thickness (μm) 1.0.250.250.250.25
Tstart (C) 40.60.50.60.50.
Tend (C) 260.260.250.280.250.
Heat rate (K/min) 5.5.3.3.3.
Initial hold (min) 1.
Final hold (min) 15.   10.
I 1213.1172.1164.1166.1172.
ReferenceRocha, Coelho, et al., 2007Sabulal, Dan, et al., 2007Simoniatto, Bonani, et al., 2007Vagionas, Ngassapa, et al., 2007Yu, Liao, et al., 2007
Comment MSDC-RI MSDC-RI MSDC-RI MSDC-RI MSDC-RI
Column type CapillaryCapillaryCapillaryCapillaryCapillary
Active phase HP-5MSCP Sil 5 CBDB-5BP-1BP-1
Column length (m) 30.30.30.50.50.
Carrier gas HeN2HeHeHe
Substrate
Column diameter (mm) 0.250.250.250.220.25
Phase thickness (μm) 0.250.250.250.250.25
Tstart (C) 80.50.60.60.60.
Tend (C) 300.200.240.220.220.
Heat rate (K/min) 4.5.3.2.2.
Initial hold (min)
Final hold (min)    20.20.
I 1171.1165.1165.1150.1148.
ReferenceZeng, Zhao, et al., 2007Andrianoelisoa H.S., Menut C., et al., 2006Block, Flamini, et al., 2006Boti, Bighelli, et al., 2006Bousmaha, Boti, et al., 2006
Comment MSDC-RI MSDC-RI MSDC-RI MSDC-RI MSDC-RI
Column type CapillaryCapillaryCapillaryCapillaryCapillary
Active phase RTX-1HP-5MSDB-5DB-5BP-1
Column length (m) 60.30.30.30.50.
Carrier gas HeHeN2N2He
Substrate
Column diameter (mm) 0.220.250.320.250.22
Phase thickness (μm) 0.250.250.250.250.25
Tstart (C) 60.60.60.60.60.
Tend (C) 230.280.240.240.220.
Heat rate (K/min) 2.3.3.3.2.
Initial hold (min)   3.3.
Final hold (min) 45. 5.3.20.
I 1150.1166.1164.1165.1150.
ReferenceCavalli, Tomi, et al., 2006Chorianopoulos N., Evergets E., et al., 2006Dob, Dahmane, et al., 2006Dob, Dahmane, et al., 2006, 2Duquesnoy, Dinh, et al., 2006
Comment MSDC-RI MSDC-RI MSDC-RI MSDC-RI MSDC-RI
Column type CapillaryCapillaryCapillaryCapillaryCapillary
Active phase DB-5BP-1HP-5DB-1HP-5
Column length (m) 50.50.30.30.30.
Carrier gas N2HeHeN2He
Substrate
Column diameter (mm) 0.20.220.250.250.25
Phase thickness (μm) 0.320.250.250.250.25
Tstart (C) 60.60.60.50.60.
Tend (C) 220.220.250.220.250.
Heat rate (K/min) 5.2.3.4.10.
Initial hold (min) 3.   2.
Final hold (min) 5.20.  10.
I 1165.1151.1169.1154.1175.
ReferenceEsmaeili, Nematollahi, et al., 2006Gonny, Cavaleiro, et al., 2006Javidnia, Miri, et al., 2006Kuiate, Bessière, et al., 2006Liu J.M., Nan P., et al., 2006
Comment MSDC-RI MSDC-RI MSDC-RI MSDC-RI MSDC-RI
Column type CapillaryCapillaryCapillaryCapillaryCapillary
Active phase HP-1RTX-1HP-5MSSPB-1SPB-1
Column length (m) 25.60.30.30.30.
Carrier gas HeHeHeHeHe
Substrate
Column diameter (mm) 0.20.220.250.20.25
Phase thickness (μm) 0.330.250.250.20.25
Tstart (C) 60.60.60.70.50.
Tend (C) 300.230.280.220.250.
Heat rate (K/min) 5.2.3.3.5.
Initial hold (min) 3.   3.
Final hold (min) 30.35. 15.15.
I 1144.1150.1146.1144.1162.
ReferenceNath, Baruah, et al., 2006Paolini J., Desjobert J.M., et al., 2006Pavlovic, Kovacevic, et al., 2006Pinto, Pina-Vaz, et al., 2006Radulovic, Mananjarasoa, et al., 2006
Comment MSDC-RI MSDC-RI MSDC-RI MSDC-RI MSDC-RI
Column type CapillaryCapillaryCapillaryCapillaryCapillary
Active phase DB-1SPB-1DB-5HP-5MSCP Sil 5 CB
Column length (m) 30.30.30.30.25.
Carrier gas HeHeHeH2H2
Substrate
Column diameter (mm) 0.250.20.250.250.25
Phase thickness (μm) 0.250.20.250.25
Tstart (C) 50.70.50.50.80.
Tend (C) 265.220.250.285.270.
Heat rate (K/min) 2.53.5.4.310.
Initial hold (min)   2.
Final hold (min)  15.
I 1165.1146.1169.1168.1150.
ReferenceRamezani, Behravan, et al., 2006Salgueiro L.R., Pinto E., et al., 2006Su, Ho, et al., 2006Vujisic L., Vuckovic I., et al., 2006Ziegenbein, Hanssen, et al., 2006
Comment MSDC-RI MSDC-RI MSDC-RI MSDC-RI MSDC-RI
Column type CapillaryCapillaryCapillaryCapillaryCapillary
Active phase SPB-1DB-5SE-54HP-5RTX-1
Column length (m) 30.30.50.30.60.
Carrier gas HeHeH2N2
Substrate
Column diameter (mm) 0.250.20.250.250.22
Phase thickness (μm) 0.250.250.270.250.25
Tstart (C) 50.50.50.60.60.
Tend (C) 250.250.300.220.220.
Heat rate (K/min) 5.5.5.5.2.
Initial hold (min) 3.3. 10.
Final hold (min) 15.15.  20.
I 1162.1155.1165.1169.1151.
ReferenceBoskovic, Radulovic, et al., 2005Boskovic, Radulovic, et al., 2005Brantner, Pfeifhofer, et al., 2005Cioni, Flamini, et al., 2005Cozzani, Muselli, et al., 2005
Comment MSDC-RI MSDC-RI MSDC-RI MSDC-RI MSDC-RI
Column type CapillaryCapillaryCapillaryCapillaryCapillary
Active phase DB-1DB-15 % Phenyl methyl siloxaneCP Sil 5 CBDB-5
Column length (m) 30.30.30.50.25.
Carrier gas N2 HeH2N2
Substrate
Column diameter (mm) 0.320.320.250.220.25
Phase thickness (μm) 0.250.251.0.130.25
Tstart (C) 50.50.40.40.75.
Tend (C) 260.250.250.300.210.
Heat rate (K/min) 2.2.7.4.3.
Initial hold (min) 3.8.10. 10.
Final hold (min) 5. 5.10.1.
I 1165.1149.1210.1145.1167.
ReferenceDob, Berramdane, et al., 2005Dob, Dahmane, et al., 2005Estevez, Ventanas, et al., 2005Idzojtic, Kajba, et al., 2005bin Jantan, Yalvema, et al., 2005
Comment MSDC-RI MSDC-RI MSDC-RI MSDC-RI MSDC-RI
Column type CapillaryCapillaryCapillaryCapillaryCapillary
Active phase RTX-1HP-5MSDB-5DB-5DB-5MS
Column length (m) 60.30.30.30.60.
Carrier gas HeHeHeHeHe
Substrate
Column diameter (mm) 0.220.250.250.250.25
Phase thickness (μm) 0.250.250.260.250.25
Tstart (C) 60.60.60.40.40.
Tend (C) 230.250.210.260.200.
Heat rate (K/min) 2.4.3.2.2.
Initial hold (min)  2. 5.
Final hold (min) 35.20. 20.20.
I 1149.1164.1179.1164.1160.
ReferencePaolini, Costa, et al., 2005Pino, Mesa, et al., 2005Sati and Mathela, 2005Senatore, Napolitano, et al., 2005Seo and Baek, 2005
Comment MSDC-RI MSDC-RI MSDC-RI MSDC-RI MSDC-RI
Column type CapillaryCapillaryCapillaryCapillaryCapillary
Active phase Mega 5MSHP-5MSHP-5MSHP-5MSDB-5
Column length (m) 30.30.30.30.30.
Carrier gas HeHeHeHeN2
Substrate
Column diameter (mm) 0.250.250.250.250.25
Phase thickness (μm) 0.250.250.250.250.25
Tstart (C) 40.80.80.80.45.
Tend (C) 240.290.290.290.180.
Heat rate (K/min) 3.2.4.6.2.5
Initial hold (min) 2.   10.
Final hold (min)     20.
I 1152.1166.1170.81171.81165.
ReferenceVerzera, Trozzi, et al., 2005Zhao, Liang, et al., 2005Zhao, Liang, et al., 2005Zhao, Liang, et al., 2005Zhang, Xu, et al., 2005
Comment MSDC-RI MSDC-RI MSDC-RI MSDC-RI MSDC-RI
Column type CapillaryCapillaryCapillaryCapillaryCapillary
Active phase SE-54SPB-1HP-5HP-5MSHP-5
Column length (m) 30.30.30.30.30.
Carrier gas HeHe HeHe
Substrate
Column diameter (mm) 0.250.250.250.250.25
Phase thickness (μm) 0.250.250.250.250.25
Tstart (C) 60.70.60.60.60.
Tend (C) 260.220.220.280.240.
Heat rate (K/min) 2.3.5.3.3.
Initial hold (min) 5. 10.
Final hold (min)  15.
I 1162.1144.1169.1166.1175.
ReferenceAlma, Nitz, et al., 2004Antunes, Sevinate-Pinto, et al., 2004Ceccarini, Macchia, et al., 2004Chorianopoulos, Kalpoutzakis, et al., 2004Flamini, Bader, et al., 2004
Comment MSDC-RI MSDC-RI MSDC-RI MSDC-RI MSDC-RI
Column type CapillaryCapillaryCapillaryCapillaryCapillary
Active phase DB-5BP-1HP-5DB-5HP-5MS
Column length (m) 30.50.30.30.30.
Carrier gas N2 HeHeHe
Substrate
Column diameter (mm) 0.250.220.250.250.25
Phase thickness (μm) 0.250.25 0.250.25
Tstart (C) 60.60.60.60.60.
Tend (C) 240.220.260.260.280.
Heat rate (K/min) 3.2.3.3.4.
Initial hold (min)     5.
Final hold (min)  20.
I 1168.1149.1166.1165.1166.
ReferenceFlamini, Cioni, et al., 2004Gonny, Bradesi, et al., 2004Javidnia, Miri, et al., 2004Javidnia, Miri, et al., 2004, 2Karioti, Hadjipavlou-Litina, et al., 2004
Comment MSDC-RI MSDC-RI MSDC-RI MSDC-RI MSDC-RI
Column type CapillaryCapillaryCapillaryCapillaryCapillary
Active phase DB-5MSSPB-1SPB-1HP-5MSHP-5MS
Column length (m) 30.30.30.30.30.
Carrier gas HeHeHeHeHe
Substrate
Column diameter (mm) 0.250.20.20.250.25
Phase thickness (μm) 0.250.20.20.250.25
Tstart (C) 40.70.70.50.50.
Tend (C) 280.220.220.300.250.
Heat rate (K/min) 4.3.3.5.3.
Initial hold (min) 2.  5.
Final hold (min)  15.15.
I 1173.1149.1149.1167.1167.
ReferenceMardarowicz, Wianowska, et al., 2004Moldão-Martins, Beirão-da-Costa, et al., 2004Moldão-Martins, Beirão-da-Costa, et al., 2004Mumm, Tiemann, et al., 2004Salido, Valenzuela, et al., 2004
Comment MSDC-RI MSDC-RI MSDC-RI MSDC-RI MSDC-RI
Column type CapillaryCapillaryCapillaryCapillaryCapillary
Active phase HP-5BP-1HP-5MSDB-5MSDB-5MS
Column length (m) 25.50.30.30.30.
Carrier gas HeHeHeHeHe
Substrate
Column diameter (mm) 0.20.220.250.250.25
Phase thickness (μm) 0.330.250.250.250.25
Tstart (C) 60.60.50.40.40.
Tend (C) 240.220.200.200.200.
Heat rate (K/min) 3.2.6.4.4.
Initial hold (min)   1.55.5.
Final hold (min) 7.20.5.20.20.
I 1169.1148.1174.1171.1171.
ReferenceSartoratto, Machado, et al., 2004Tam, Thuam, et al., 2004Weissbecker, Holighaus, et al., 2004Yu, Kim, et al., 2004Yu, Kim, et al., 2004
Comment MSDC-RI MSDC-RI MSDC-RI MSDC-RI MSDC-RI
Column type CapillaryCapillaryCapillaryCapillaryCapillary
Active phase DB-5MSDB-5BPX-5HP-5HP-5
Column length (m) 30.25.30.30.30.
Carrier gas HeN2N2N2N2
Substrate
Column diameter (mm) 0.250.250.250.250.25
Phase thickness (μm) 0.250.250.250.250.25
Tstart (C) 40.75.75.60.60.
Tend (C) 200.210.210.220.220.
Heat rate (K/min) 4.3.3.5.5.
Initial hold (min) 5.10.10.10.10.
Final hold (min) 20.1.1.
I 1171.1166.1166.1167.1167.
ReferenceYu, Kim, et al., 2004, 2bin Ahmad and bin Jantan, 2003bin Ahmad and bin Jantan, 2003, 2Angelini, Carpanese, et al., 2003Angelini, Carpanese, et al., 2003
Comment MSDC-RI MSDC-RI MSDC-RI MSDC-RI MSDC-RI
Column type CapillaryCapillaryCapillaryCapillaryCapillary
Active phase DB-5DB-5SPB-1RTX-1SPB-1
Column length (m) 30.30.30.60.25.
Carrier gas HeHeHeHe
Substrate
Column diameter (mm) 0.250.250.20.220.25
Phase thickness (μm) 0.250.250.20.250.25
Tstart (C) 60.60.70.60.35.
Tend (C) 240.240.220.230.225.
Heat rate (K/min) 3.3.3.2.4.
Initial hold (min)     10.
Final hold (min) 30. 15.45.
I 1167.1168.1149.1150.1147.
ReferenceBader, Caponi, et al., 2003Bader, Flamini, et al., 2003Cavaleiro, Salgueiro, et al., 2003Cavalli, Tomi, et al., 2003Chisholm, Wilson, et al., 2003
Comment MSDC-RI MSDC-RI MSDC-RI MSDC-RI MSDC-RI
Column type CapillaryCapillaryCapillaryCapillaryCapillary
Active phase SPB-1DB-1HP-5HP-5HP-5
Column length (m) 25.30.30.30.30.
Carrier gas  HeN2N2
Substrate
Column diameter (mm) 0.250.250.250.250.25
Phase thickness (μm) 0.250.250.250.25
Tstart (C) 35.40.60.60.25.
Tend (C) 225.250.220.220.150.
Heat rate (K/min) 4.2.5.5.3.
Initial hold (min) 10.5.10.10.5.
Final hold (min)  20.
I 1147.1137.1175.1167.1165.
ReferenceChisholm, Wilson, et al., 2003de Feo, Bruno, et al., 2003Flamini, Luigi Cioni, et al., 2003Flamini, Luigi Cioni, et al., 2003, 2Isidorov, Vinogorova, et al., 2003
Comment MSDC-RI MSDC-RI MSDC-RI MSDC-RI MSDC-RI
Column type CapillaryCapillaryCapillaryCapillaryCapillary
Active phase DB-5DB-5DB-5HP-5HP-5
Column length (m) 30.30.25.30.30.
Carrier gas HeN2HeHeHe
Substrate
Column diameter (mm) 0.250.250.250.250.25
Phase thickness (μm) 0.250.25 0.250.25
Tstart (C) 75.75.60.60.60.
Tend (C) 230.230.260.240.280.
Heat rate (K/min) 3.3.4.3.3.
Initial hold (min) 10.10.
Final hold (min) 20.
I 1166.1166.1168.1168.1165.
ReferenceJantan, Ling, et al., 2003bin Jantan, Yassin, et al., 2003Javidnia, Miri, et al., 2003Macchioni, Cioni, et al., 2003Ngassapa, Runyoro, et al., 2003
Comment MSDC-RI MSDC-RI MSDC-RI MSDC-RI MSDC-RI
Column type CapillaryCapillaryCapillaryCapillaryCapillary
Active phase HP-5MSMS5HP-5HP-5HP-5
Column length (m) 30.25.30.30.30.
Carrier gas He HeHeHe
Substrate
Column diameter (mm) 0.250.250.250.250.25
Phase thickness (μm) 0.250.250.250.250.25
Tstart (C) 50.40.60.60.60.
Tend (C) 250.180.280.280.280.
Heat rate (K/min) 3.3.3.3.3.
Initial hold (min)
Final hold (min)
I 1165.1165.1169.1169.1168.
ReferenceSalido, Altarejos, et al., 2003Shao, Marriott, et al., 2003Tsiri, Kretsi, et al., 2003Tsiri, Kretsi, et al., 2003Tzakou, Couladis, et al., 2003
Comment MSDC-RI MSDC-RI MSDC-RI MSDC-RI MSDC-RI
Column type CapillaryCapillaryCapillaryCapillaryCapillary
Active phase HP-5MSDB-5DB-5HP-5RTX-5 MS
Column length (m) 30.30.30.30.30.
Carrier gas   HeN2He
Substrate
Column diameter (mm) 0.250.250.250.250.25
Phase thickness (μm) 0.250.250.250.250.25
Tstart (C) 50.50.60.60.45.
Tend (C) 280.280.240.220.180.
Heat rate (K/min) 3.3.3.5.2.5
Initial hold (min) 5.5. 10.10.
Final hold (min)
I 1165.1165.1168.1175.1165.
ReferenceDemetzos, Angelopoulou, et al., 2002Economakis, Skaltsa, et al., 2002Flamini, Cioni, et al., 2002Flamini, Cioni, et al., 2002, 2Hudaib, Speroni, et al., 2002
Comment MSDC-RI MSDC-RI MSDC-RI MSDC-RI MSDC-RI
Column type CapillaryCapillaryCapillaryCapillaryCapillary
Active phase DB-1HP-5DB-5RTX-5HP-1
Column length (m) 25.30.25.30.24.
Carrier gas N2HeHeHeHe
Substrate
Column diameter (mm) 0.250.250.250.250.32
Phase thickness (μm)  0.25 0.250.17
Tstart (C) 60.60.70.45.60.
Tend (C) 180.280.260.300.250.
Heat rate (K/min) 3.3.4.3.4.
Initial hold (min) 10.5. 6.2.
Final hold (min) 10.  10.20.
I 1154.1165.1165.1167.1144.
Referencebin Jantan and bin Ahmad, 2002Magiatis, Skaltsounis, et al., 2002Miri, Ramezani, et al., 2002Mondello, Zappia, et al., 2002Nath, Sarma, et al., 2002
Comment MSDC-RI MSDC-RI MSDC-RI MSDC-RI MSDC-RI
Column type CapillaryCapillaryCapillaryCapillaryCapillary
Active phase CP Sil 5 CBCP Sil 5 CBCP Sil 5 CBDB-1RTX-5
Column length (m) 25.30.50.50.30.
Carrier gas N2H2HeHeHe
Substrate
Column diameter (mm) 0.250.250.320.220.25
Phase thickness (μm) 0.250.250.40.250.25
Tstart (C) 60.60.60.60.45.
Tend (C) 280.280.280.220.250.
Heat rate (K/min) 4.2.3.2.3.
Initial hold (min) 6.10.10. 6.
Final hold (min)  40.60.20.
I 1147.1151.1151.1150.1165.
ReferencePino, Marbot, et al., 2002Pino, Marbot, et al., 2002, 2Pino, Marbot, et al., 2002, 3Pintore, Usai, et al., 2002Shellie, Mondello, et al., 2002
Comment MSDC-RI MSDC-RI MSDC-RI MSDC-RI MSDC-RI
Column type CapillaryCapillaryCapillaryCapillaryCapillary
Active phase RTX-5HP-5HP-5BP-1SPB-1
Column length (m) 30.30.30.50.15.
Carrier gas HeHeHeHe
Substrate
Column diameter (mm) 0.250.250.250.220.25
Phase thickness (μm) 0.250.250.250.250.25
Tstart (C) 45.60.60.60.35.
Tend (C) 250.280.280.230.225.
Heat rate (K/min) 3.3.3.2.6.
Initial hold (min) 6.5.5. 3.
Final hold (min)    35.10.
I 1172.1166.1164.1151.1147.
ReferenceShellie, Mondello, et al., 2002Aligiannis, Kalpoutzakis, et al., 2001Aligiannis, Kalpoutzakis, et al., 2001, 2Bianchini, Tomi, et al., 2001Chisholm, Wilson, et al., 2001
Comment MSDC-RI MSDC-RI MSDC-RI MSDC-RI MSDC-RI
Column type CapillaryCapillaryCapillaryCapillaryCapillary
Active phase SPB-1HP-5HP-5HP-5HP-5MS
Column length (m) 15.30.30.30.30.
Carrier gas  HeHeHeHe
Substrate
Column diameter (mm) 0.250.250.250.250.25
Phase thickness (μm) 0.250.250.250.500.25
Tstart (C) 35.60.60.60.60.
Tend (C) 225.260.380.280.280.
Heat rate (K/min) 6.3.3.3.3.
Initial hold (min) 3.   5.
Final hold (min) 10.10.
I 1147.1163.1164.1168.1165.
ReferenceChisholm, Wilson, et al., 2001Couladis, Baziou, et al., 2001Couladis, Tsortanidou, et al., 2001Couladis, Tzakou, et al., 2001Giamakis, Kretsi, et al., 2001
Comment MSDC-RI MSDC-RI MSDC-RI MSDC-RI MSDC-RI
Column type CapillaryCapillaryCapillaryCapillaryCapillary
Active phase HP-1HP-5RTX-5 MSSE-30CP Sil 5 CB
Column length (m) 60.50.30.25.50.
Carrier gas HeHeHeN2He
Substrate
Column diameter (mm) 0.250.250.250.200.32
Phase thickness (μm) 0.250.250.25 0.4
Tstart (C) 50.50.70.60.60.
Tend (C) 250.250.210.180.280.
Heat rate (K/min) 2.52.54.3.3.
Initial hold (min) 5.5.10.10.10.
Final hold (min)   10.1.60.
I 1160.1165.1170.1166.1151.
ReferenceGuilliard, Delgado, et al., 2001Guilliard, Delgado, et al., 2001Hudaib, Grazia Bellardi, et al., 2001bin Jantan, Basni, et al., 2001Pino, Marbot, et al., 2001
Comment MSDC-RI MSDC-RI MSDC-RI MSDC-RI MSDC-RI
Column type CapillaryCapillaryCapillaryCapillaryCapillary
Active phase BP-1HP-5MSHP-5MSSE-54DB-5
Column length (m) 50.30.30.25.60.
Carrier gas  HeHe He
Substrate
Column diameter (mm) 0.220.250.250.310.25
Phase thickness (μm) 0.250.250.25 0.25
Tstart (C) 60.50.60.35.40.
Tend (C) 220.250.280.230.290.
Heat rate (K/min) 2.3.4.4.4.
Initial hold (min)   5.3.2.
Final hold (min) 20.  10.5.
I 1148.1167.1165.1175.901160.
ReferenceRezzi, Cavaleiro, et al., 2001Salido, Altarejos, et al., 2001Skaltsa, Mavrommati, et al., 2001Yin, Xiu, et al., 2001Bartley and Jacobs, 2000
Comment MSDC-RI MSDC-RI MSDC-RI MSDC-RI MSDC-RI
Column type CapillaryCapillaryCapillaryCapillaryCapillary
Active phase HP-5CP Sil 5 CBDB-1DB-1DB-1
Column length (m) 30.50.60.60.60.
Carrier gas HeH2 HeHe
Substrate
Column diameter (mm) 0.250.220.320.320.25
Phase thickness (μm) 0.250.131. 0.25
Tstart (C) 40.40.-50.60.50.
Tend (C) 200.300.175.230.220.
Heat rate (K/min) 2.4.6.3.4.
Initial hold (min) 5. 2.
Final hold (min) 20.10. 5.
I 1160.1155.1162.91155.1155.
ReferenceKim, Thuy, et al., 2000Pfeifhofer, 2000Helmig, Klinger, et al., 1999Javidnia and Shafiee, 1999Mirza and Sefidkon, 1999
Comment MSDC-RI MSDC-RI MSDC-RI MSDC-RI MSDC-RI
Column type CapillaryCapillaryCapillaryCapillaryCapillary
Active phase HP-1Methyl SiliconeCP Sil 5 CBOV-1DB-5
Column length (m) 60.50.25.25.30.
Carrier gas HeN2He
Substrate
Column diameter (mm) 0.250.250.250.250.25
Phase thickness (μm) 0.250.17 0.30.25
Tstart (C) 50.80.60.50.50.
Tend (C) 250.200.260.200.250.
Heat rate (K/min) 2.52.5.3.3.
Initial hold (min) 5.  1.
Final hold (min)    20.
I 1169.1164.1155.1143.1166.
ReferenceStashenko, Cervantes, et al., 1999Sumathykutty, Rao, et al., 1999Weyerstahl, Marschall, et al., 1999Bicchi, Rubiolo, et al., 1998Isidorov, Zenkevich, et al., 1998
Comment MSDC-RI MSDC-RI MSDC-RI MSDC-RI MSDC-RI
Column type CapillaryCapillaryCapillaryCapillaryCapillary
Active phase BP-1Methyl SiliconeBP-1DB-5Methyl Silicone
Column length (m) 50. 50.30.25.
Carrier gas He HeHeHe
Substrate
Column diameter (mm) 0.22 0.220.260.2
Phase thickness (μm) 0.25 0.250.250.3
Tstart (C) 60.50.60.50.40.
Tend (C) 220.250.230.225.200.
Heat rate (K/min) 2.4.2.2.2.
Initial hold (min)
Final hold (min) 20. 35.20.
I 1154.1149.1148.1174.1164.
ReferenceTam, An, et al., 1998Analytical Methods Committee, 1997Mariotti, Tomi, et al., 1997Sagrero-Nieves, Bartley, et al., 1997Píry, Príbela, et al., 1995
Comment MSDC-RI MSDC-RI MSDC-RI MSDC-RI MSDC-RI
Column type CapillaryCapillaryCapillaryCapillaryCapillary
Active phase DB-1CP Sil 5 CBHP-101OV-101OV-101
Column length (m) 60.25.50.50.50.
Carrier gas  HeN2N2N2
Substrate
Column diameter (mm) 0.320.220.250.250.25
Phase thickness (μm) 0.50.11
Tstart (C) 40.80.70.80.80.
Tend (C) 290.230.200.200.200.
Heat rate (K/min) 4.1.3.2.2.
Initial hold (min) 2.8.
Final hold (min) 5.16.
I 1154.1147.1180.1153.1155.
ReferenceBartley and Foley, 1994Chanegriha and Baaliouamer, 1993Chung, Eiserich, et al., 1993Yang, Sugisawa, et al., 1992Yang, Sugisawa, et al., 1992
Comment MSDC-RI MSDC-RI MSDC-RI MSDC-RI MSDC-RI
Column type CapillaryCapillaryCapillaryPackedCapillary
Active phase OV-101OV-1OV-1OV-101OV-101
Column length (m) 50.30.30.2.
Carrier gas H2HeHeAr
Substrate    W-AW-DMCS
Column diameter (mm) 0.320.50.5
Phase thickness (μm)  0.80.8
Tstart (C) 50.40.40.100.100.
Tend (C) 200.220.220.
Heat rate (K/min) 2.2.2.2.2.
Initial hold (min)
Final hold (min)
I 1146.1144.1149.1153.1153.
ReferencePieribattesti, Smadja, et al., 1988De Pooter, Omar, et al., 1985De Pooter, Omar, et al., 1985Szabolcs, Benecke, et al., 1985Benecke, Thieme, et al., 1982
Comment MSDC-RI MSDC-RI MSDC-RI MSDC-RI MSDC-RI

Normal alkane RI, polar column, temperature ramp

Data compiled by: NIST Mass Spectrometry Data Center, William E. Wallace, director

Column type CapillaryCapillaryCapillaryCapillaryCapillary
Active phase RTX-WaxBP-20VF-Wax MSBP-20Supelcowax-10
Column length (m) 60.50.60. 30.
Carrier gas HeliumHeliumHeliumNitrogenHelium
Substrate
Column diameter (mm) 0.220.220.25 0.20
Phase thickness (μm) 0.250.250.25 0.20
Tstart (C) 60.60.60.60.70.
Tend (C) 230.220.220.200.220.
Heat rate (K/min) 2.2.3.5.3.
Initial hold (min)   5.
Final hold (min) 5.20.25. 15.
I 1670.1691.1703.1692.1695.
ReferenceBendiabdellah, El Amine Dib, et al., 2012Yapi, Boti, et al., 2012Duarte, Dias, et al., 2010Mishra, Chaudhary, et al., 2010Neves, Rosa, et al., 2010
Comment MSDC-RI MSDC-RI MSDC-RI MSDC-RI MSDC-RI
Column type CapillaryCapillaryCapillaryCapillaryCapillary
Active phase RTX-WaxBP-20HP-InnowaxHP-InnowaxCarbowax
Column length (m) 60.50.30.50.60.
Carrier gas HeliumHeliumNitrogenHeliumHe
Substrate
Column diameter (mm) 0.220.220.250.200.2
Phase thickness (μm) 0.250.250.520.200.25
Tstart (C) 60.60.35.45.60.
Tend (C) 230.220.205.190.250.
Heat rate (K/min) 2.2.3.4.2.
Initial hold (min)   10.2.8.
Final hold (min) 30.20.10.50.15.
I 1664.1703.1719.1714.1679.
ReferenceMuseli, Pau, et al., 2009Ottavioli, Bighelli, et al., 2009Wannes, Mhamdi, et al., 2009Soria, Sanz, et al., 2008Ferhat, Meklati, et al., 2007
Comment MSDC-RI MSDC-RI MSDC-RI MSDC-RI MSDC-RI
Column type CapillaryCapillaryCapillaryCapillaryCapillary
Active phase CarbowaxCP-Wax 52CBSupelcowax-10Supelcowax-10Innowax
Column length (m) 60.30.30.30.30.
Carrier gas HeHeHeHeN2
Substrate
Column diameter (mm) 0.20.320.20.250.25
Phase thickness (μm) 0.250.250.20.250.25
Tstart (C) 60.40.70.50.50.
Tend (C) 250.220.220.250.280.
Heat rate (K/min) 2.3.3.2.9.
Initial hold (min) 8.1.  3.
Final hold (min) 15.2.15. 3.
I 1682.1706.1696.1702.1675.
ReferenceFerhat, Tigrine-Kordjani, et al., 2007Hymete, Rohloff, et al., 2007Pinto, Salgueiro, et al., 2007Raal, Orav, et al., 2007Abdelwahed, Hayder, et al., 2006
Comment MSDC-RI MSDC-RI MSDC-RI MSDC-RI MSDC-RI
Column type CapillaryCapillaryCapillaryCapillaryCapillary
Active phase InnowaxSupelcowax 10HP-20MFFAPHP-Wax
Column length (m) 30.30.50.20.30.
Carrier gas N2HeliumHeHeNitrogen
Substrate
Column diameter (mm) 0.250.200.20.250.25
Phase thickness (μm) 0.250.200.10.250.25
Tstart (C) 50.70.60.90.50.
Tend (C) 280.220.220.250.280.
Heat rate (K/min) 9.3.2.6.5.
Initial hold (min) 3.
Final hold (min) 3.15.30. 5.
I 1705.1695.1652.1745.1691.
ReferenceAbdelwahed, Hayder, et al., 2006Cavaleiro, Pinto, et al., 2006Filippi, Lanfranchi, et al., 2006Kitchlu, Bakshi, et al., 2006Marzouk, Mansour, et al., 2006
Comment MSDC-RI MSDC-RI MSDC-RI MSDC-RI MSDC-RI
Column type CapillaryCapillaryCapillaryCapillaryCapillary
Active phase HP-20MHP-20MDB-InnowaxNB-20MSupelcowax-10
Column length (m) 30.50.60.30.30.
Carrier gas N2HeHeliumHeHe
Substrate
Column diameter (mm) 0.250.20.250.20.25
Phase thickness (μm) 0.250.20.250.250.25
Tstart (C) 50.70.60.50.50.
Tend (C) 250.180.240.250.250.
Heat rate (K/min) 5.4.3.2.4.
Initial hold (min)  4.  1.
Final hold (min) 10.15.20. 10.
I 1691.1654.1698.1700.1693.
ReferenceMarzouk, Neffati, et al., 2006Mastelic, Jerkovic, et al., 2006Mendivil, Rodrigues, et al., 2006Orav, Raal, et al., 2006Wong, Sivasothy, et al., 2006
Comment MSDC-RI MSDC-RI MSDC-RI MSDC-RI MSDC-RI
Column type CapillaryCapillaryCapillaryCapillaryCapillary
Active phase InnowaxHP-20MStabilwaxInnowaxCP-Wax
Column length (m) 50.50.30.60.30.
Carrier gas HeHeliumH2HeHe
Substrate
Column diameter (mm) 0.20.200.320.250.32
Phase thickness (μm) 0.50.200.50.250.25
Tstart (C) 60.70.40.60.40.
Tend (C) 250.250.280.240.180.
Heat rate (K/min) 2.4.6.5.5.
Initial hold (min)  4.5. 2.
Final hold (min) 60.10.5.30.
I 1723.1653.1679.1706.1690.
ReferenceBendimerad and Bendiab, 2005Bezic, Skocibusic, et al., 2005Jirovetz, Buchbauer, et al., 2005Joichi, Yomogida, et al., 2005Ka, Choi, et al., 2005
Comment MSDC-RI MSDC-RI MSDC-RI MSDC-RI MSDC-RI
Column type CapillaryCapillaryCapillaryCapillaryCapillary
Active phase HP-20MHP-20MDB-WaxDB-WaxPEG-20M
Column length (m) 50.50.30.60.30.
Carrier gas HeliumHeliumHeNitrogen
Substrate
Column diameter (mm) 0.200.200.250.320.25
Phase thickness (μm) 0.200.200.250.50
Tstart (C) 70.70.50.35.60.
Tend (C) 180.180.180.235.180.
Heat rate (K/min) 4.4.3.2.3.
Initial hold (min) 4.4. 4.10.
Final hold (min) 10.10.40.30.30.
I 1653.1653.1692.1728.1710.
ReferenceKulisic, Radonic, et al., 2005Kulisic, Radonic, et al., 2005Lee, Umano, et al., 2005Qian and Wang, 2005Yao, Guo, et al., 2005
Comment MSDC-RI MSDC-RI MSDC-RI MSDC-RI MSDC-RI
Column type CapillaryCapillaryCapillaryCapillaryCapillary
Active phase DB-WaxBP-20Supelcowax-10Innowax FSCNB-20M
Column length (m) 30.50.60.60.50.
Carrier gas He HeHeliumHe
Substrate
Column diameter (mm) 0.250.220.20.250.2
Phase thickness (μm) 0.250.250.2 0.25
Tstart (C) 90.60.60.60.50.
Tend (C) 220.220.200.220.250.
Heat rate (K/min) 7.2.4.4.2.
Initial hold (min) 2.  10.
Final hold (min) 5.20.40.
I 1746.1690.1663.1719.1720.
ReferenceAgnihotri, Thappa, et al., 2004Blanc, Muselli, et al., 2004Gauvin, Ravaomanarivo, et al., 2004Lourens, Reddy, et al., 2004Raal, Arak, et al., 2004
Comment MSDC-RI MSDC-RI MSDC-RI MSDC-RI MSDC-RI
Column type CapillaryCapillaryCapillaryCapillaryCapillary
Active phase SW-10HP-InnowaxSupelcowax-10Carbowax 20MSW-10
Column length (m) 50.50.30.50.50.
Carrier gas HeHeHeN2He
Substrate
Column diameter (mm) 0.200.20.250.250.20
Phase thickness (μm) 0.250.20.250.250.25
Tstart (C) 50.45.60.90.50.
Tend (C) 230.190.240.220.250.
Heat rate (K/min) 2.4.4.3.2.
Initial hold (min)  2.
Final hold (min)  50.
I 1690.1717.1718.1733.1693.
ReferenceRaal, Paaver, et al., 2004Soria, Gonzalez, et al., 2004Cabanillas, Lopez, et al., 2003Priestap, van Baren, et al., 2003Raal, Arak, et al., 2003
Comment MSDC-RI MSDC-RI MSDC-RI MSDC-RI MSDC-RI
Column type CapillaryCapillaryCapillaryCapillaryCapillary
Active phase InnowaxHP-InnowaxSupelcowax-10HP-WaxCarbowax 20M
Column length (m) 60.50.60.50.50.
Carrier gas HeHeHeN2He
Substrate
Column diameter (mm) 0.250.20.20.250.22
Phase thickness (μm)  0.20.50.250.25
Tstart (C) 60.70.70.75.60.
Tend (C) 220.190.220.220.220.
Heat rate (K/min) 4.5.2.3.2.
Initial hold (min) 10.  4.
Final hold (min) 10.
I 1719.1706.1693.1728.1704.
ReferenceSuleimenov, Atazharova, et al., 2003Velasco-Negueruela, Pérez-Alonso, et al., 2003Orav, Kailas, et al., 2002Priestap, van Baren, et al., 2002Vernin, Lageot, et al., 2001
Comment MSDC-RI MSDC-RI MSDC-RI MSDC-RI MSDC-RI
Column type CapillaryCapillaryCapillaryCapillaryCapillary
Active phase CP-Wax 52CBSupelcowax-10HP-20MDB-WaxDB-Wax
Column length (m) 50.60.50.60.60.
Carrier gas HeHeHeHeliumHe
Substrate
Column diameter (mm) 0.300.250.200.320.25
Phase thickness (μm) 0.250.250.200.250.25
Tstart (C) 40.60.70.50.40.
Tend (C) 220.280.180.230.200.
Heat rate (K/min) 3.4.4.5.2.
Initial hold (min) 5. 4.2.2.
Final hold (min)
I 1698.1701.1655.1698.1701.
ReferenceChagonda, Makanda, et al., 2000Korány, Mednyánszky, et al., 2000Mastelic, Milos, et al., 2000Paniandy, Chane-Ming, et al., 2000Umano, Hagi, et al., 2000
Comment MSDC-RI MSDC-RI MSDC-RI MSDC-RI MSDC-RI
Column type CapillaryCapillaryCapillaryCapillaryCapillary
Active phase CW 20MSupelcowax-10HP Innowax FSPInnowaxHP-Innowax
Column length (m) 25.30.60.60.60.
Carrier gas Hydrogen HeHeHe
Substrate
Column diameter (mm) 0.320.250.250.250.25
Phase thickness (μm) 0.250.250.250.250.25
Tstart (C) 50.60.60.60.60.
Tend (C) 220.220.220.220.220.
Heat rate (K/min) 3.4.
Initial hold (min) 1. 10.10.10.
Final hold (min) 10. 10.
I 1695.1656.1719.1719.1719.
ReferenceBicchi, Binello, et al., 1999Choo, Wong, et al., 1999Kaya, Baser, et al., 1999Kaya, Baser, et al., 1999, 2Kaya, Baser, et al., 1999, 3
Comment MSDC-RI MSDC-RI MSDC-RI MSDC-RI MSDC-RI
Column type CapillaryCapillaryCapillaryCapillaryCapillary
Active phase HP-InnowaxCarbowaxDB-WaxHP-20MDB-Wax
Column length (m) 60.50.60.25.60.
Carrier gas HeN2HeHeliumN2
Substrate
Column diameter (mm) 0.250.20.250.20
Phase thickness (μm) 0.25 0.250.250.25
Tstart (C) 60.80.60.60.60.
Tend (C) 220.200.240.200.220.
Heat rate (K/min)  1.4.3.5.
Initial hold (min) 10.  4.
Final hold (min)  20.
I 1719.1698.1704.1689.1720.
ReferenceKaya, Baser, et al., 1999, 3Menon, Chacko, et al., 1999Ngassoum, Yonkeu, et al., 1999Prikhod'ko, Klyuev, et al., 1999Weyerstahl, Marschall, et al., 1999
Comment MSDC-RI MSDC-RI MSDC-RI MSDC-RI MSDC-RI
Column type CapillaryCapillaryCapillaryCapillaryCapillary
Active phase BP-20HP-InnowaxHP-Innowax FSCBP-20BP-20
Column length (m) 25.60.60.25.25.
Carrier gas H2HeHeH2H2
Substrate
Column diameter (mm) 0.330.250.250.330.33
Phase thickness (μm) 0.50.250.250.50.5
Tstart (C) 80.50.60.80.80.
Tend (C) 220.220.220.220.220.
Heat rate (K/min) 5.5.4.5.5.
Initial hold (min)  5.10.
Final hold (min)   10.
I 1717.1715.1718.1717.1717.
ReferenceBignell, Dunlop, et al., 1998Stashenko, Cervantes, et al., 1998Tümen, Baser, et al., 1998Bignell, Dunlop, et al., 1997Bignell, Dunlop, et al., 1997, 2
Comment MSDC-RI MSDC-RI MSDC-RI MSDC-RI MSDC-RI
Column type CapillaryCapillaryCapillaryCapillaryCapillary
Active phase BP-20BP-20BP-20BP-20PEG-20M
Column length (m) 25.25.25.25.50.
Carrier gas H2H2 H2He
Substrate
Column diameter (mm) 0.330.330.330.330.25
Phase thickness (μm) 0.50.50.50.5
Tstart (C) 80.80.80.80.70.
Tend (C) 220.220.220.220.250.
Heat rate (K/min) 5.5.5.5.2.
Initial hold (min)
Final hold (min)
I 1717.1717.1717.1717.1695.
ReferenceBignell, Dunlop, et al., 1997, 3Bignell, Dunlop, et al., 1997, 4Bignell, Dunlop, et al., 1997, 5Bignell, Dunlop, et al., 1997, 6Orav, Kailas, et al., 1996
Comment MSDC-RI MSDC-RI MSDC-RI MSDC-RI MSDC-RI
Column type CapillaryCapillaryCapillaryCapillaryCapillary
Active phase DB-WaxTC-WaxPEG-20MSupelcowax-10Supelcowax-10
Column length (m) 60.60.60.
Carrier gas He He
Substrate
Column diameter (mm) 0.320.250.32
Phase thickness (μm) 0.50 0.25
Tstart (C) 50.80.70.40.40.
Tend (C) 250.240.180.210.210.
Heat rate (K/min) 8.3.2.2.2.
Initial hold (min) 1.5.7.2.2.
Final hold (min) 6.  120.120.
I 1694.1707.1705.1701.1701.
ReferenceSagrero-Nieves and Bartley, 1996Shuichi, Masazumi, et al., 1996Orav, Kuningas, et al., 1995Collin, Deslauriers, et al., 1993Collin, Deslauriers, et al., 1993
Comment MSDC-RI MSDC-RI MSDC-RI MSDC-RI MSDC-RI
Column type CapillaryCapillaryPackedPacked
Active phase Carbowax 20MDB-WaxCarbowax 20MCarbowax 20M
Column length (m) 45.30.2.2.
Carrier gas HydrogenH2HydrogenHydrogen
Substrate   Gas-Chrom Z (80-100 mesh)Gas-Chrom Z (80-100 mesh)
Column diameter (mm) 0.320.25
Phase thickness (μm) 1.00.25
Tstart (C) 60.50.65.65.
Tend (C) 200.250.220.220.
Heat rate (K/min) 2.5.4.4.
Initial hold (min) 5.
Final hold (min)
I 1692.1702.1710.1710.
ReferenceKollmannsberger, Nitz, et al., 1992Perry, Baxter, et al., 1986Stancher and Pertoldi, 1967Stancher and Pertoldi, 1967
Comment MSDC-RI MSDC-RI MSDC-RI MSDC-RI

Normal alkane RI, polar column, custom temperature program

Data compiled by: NIST Mass Spectrometry Data Center, William E. Wallace, director

Column type CapillaryCapillaryCapillaryCapillaryCapillary
Active phase PEG-20M InnowaxDB-WaxInnowax FSCInnowaxHP Innowax
Column length (m) 30.60.60.60.60.
Carrier gas NitrogenHeliumHelium
Substrate
Column diameter (mm) 0.250.200.250.250.25
Phase thickness (μm) 0.250.250.250.330.33
Program 50 0C (7 min) 20 0C/min -> 130 0C (1 min) 1 0C/min -> 150 0C 8 0C/min -> 190 0C (5 min)40 0C (3 min) 2 0C/min -> 150 0C 4 0C/min -> 220 0C (20 min) 5 0C/min -> 230 0C60 0C (10 min) 4 0C/min -> 220 0C (10 min) 1 0C/min -> 240 0Cnot specifiednot specified
I 1698.1703.1719.1719.1719.
ReferenceWang, Tian, et al., 2013Gyawali and Kim, 2012Demirci, Temel, et al., 2011Noorizadeh, Farmany, et al., 2011Noorizadeh and Farmany, 2010
Comment MSDC-RI MSDC-RI MSDC-RI MSDC-RI MSDC-RI
Column type CapillaryCapillaryCapillaryCapillaryCapillary
Active phase Innowax FSCInnowax FSCHP InnowaxHP-20MHP-Innowax
Column length (m) 60.60.50.25.50.
Carrier gas HeliumHeliumHeliumHeliumHe
Substrate
Column diameter (mm) 0.250.250.200.200.2
Phase thickness (μm) 0.250.250.250.200.2
Program 60 0C (10 min) 4 0C/min -> 220 0C (10 min) 1 0C/min -> 240 0C60 0C (10 min) 4 0C/min -> 220 0C (10 min) 1 0C/min -> 240 0C40 0C (5 min) 2 0C/min -> 270 0C -> 260 0C (20 min)30 0C (1 min) 50 0C/min -> 110 0C 1.5 0C/min -> 145 0C 4 0C/min -> 220 0C (10 min)40C(5min) => 2C/min => 250C(15min) => 10C/min => 270C
I 1719.1719.1719.1677.1719.
ReferencePolatoglu, Demirci, et al., 2010Baser, Demirci, et al., 2009Mancini, Arnold, et al., 2009Zellner, Amorim, et al., 2009Formisano, Mignola, et al., 2007
Comment MSDC-RI MSDC-RI MSDC-RI MSDC-RI MSDC-RI
Column type CapillaryCapillaryCapillaryCapillaryCapillary
Active phase Carbowax 20MInnowax FSCHP Innowax FSPHP-Innowax FSCInnowax FSC
Column length (m) 30.60.60.60.60.
Carrier gas HeHeN2HeN2
Substrate
Column diameter (mm) 0.250.250.250.250.25
Phase thickness (μm) 0.250.250.250.250.25
Program not specified60C(10min) => 4C/min => 220C (10min) => 1C/min => 240C60C(10min) => 4C/min => 220C(10min) => 1C/min => 240C60C(10min) => 4C/min => 220C (10min) => 1C/min => 240C60C(10min) => 4C/min => 220C(10min) => 1C/min => 240C
I 1702.1719.1719.1719.1719.
ReferenceHudaib and Aburjai, 2007Tabanca, Demirci, et al., 2007Tabanca N., Demirci B., et al., 2007Erdurak, Coskun, et al., 2006Iscan, Kirimer, et al., 2006
Comment MSDC-RI MSDC-RI MSDC-RI MSDC-RI MSDC-RI
Column type CapillaryCapillaryCapillaryCapillaryCapillary
Active phase HP-Innowax FSCHP-Innowax FSCHP-InnowaxHP-Innowax FSCCarbowax 20M
Column length (m) 60.60.60.60.
Carrier gas HeN2N2N2
Substrate
Column diameter (mm) 0.250.250.250.25
Phase thickness (μm) 0.250.250.250.25
Program 60(10min) => 4C/min => 220C(10min) => 1C/min => 240C60C(10min) => 4C/min => 220C => (10min) => 1C/min => 240C60C(10min) => 4C/min => 220C (10min) => 1C/min => 240C60C(10min) => 4C/min => 220C (10min) => 1C/min => 240Cnot specified
I 1719.1719.1719.1719.1686.
ReferenceSuleimenov Y.M., Atazhanova G.A., et al., 2006Tabanca, Demirci, et al., 2006Demirci, Demirci, et al., 2005Demirci, Demirci, et al., 2005, 2Editorial paper, 2005
Comment MSDC-RI MSDC-RI MSDC-RI MSDC-RI MSDC-RI
Column type CapillaryCapillaryCapillaryCapillaryCapillary
Active phase Carbowax 20MInnowax FSCHP-Innowax FSCHP-Innowax FSCInnowax FSC
Column length (m)  60.60.60.60.
Carrier gas  HeHeHeHe
Substrate
Column diameter (mm)  0.250.250.250.25
Phase thickness (μm)  0.250.250.250.25
Program not specified60C(10min) => 4C/min => 220C(10min) => 1C/min => 240C60C(10min) => 4C/min => 220C(10min) => 1C/min => 240C60C(10min) => 4C/min => 220C(10min) => 1C/min => 240C60C(10min) => 4C/min => 220C(10min) => 1C/min => 240C
I 1698.1719.1719.1719.1719.
ReferenceEditorial paper, 2005Kosar, Özek, et al., 2005Sezik E., Kocakulak E., et al., 2005Viljoen, Subramoney, et al., 2005Baser, Özek, et al., 2004
Comment MSDC-RI MSDC-RI MSDC-RI MSDC-RI MSDC-RI
Column type CapillaryCapillaryCapillaryCapillaryCapillary
Active phase Innowax FSCHP-Innowax FSCHP-Innowax FSCHP-InnowaxCarbowax 20M
Column length (m) 60.60.60.50.
Carrier gas HeHeHe
Substrate
Column diameter (mm) 0.250.250.250.2
Phase thickness (μm) 0.250.250.250.2
Program 60C(10min) => 4C/min => 220C(10min) => 1C/min => 240C60C(10min) => 4C/min => 220C(10min) => 1C/min => 240C60C(10min) => 4C/min => 220C(10min) => 1C/min => 240Cnot specifiednot specified
I 1719.1719.1719.1719.1698.
ReferenceBaser, Özek, et al., 2004Demirci, Paper, et al., 2004Kivcak, Akay, et al., 2004Senatore, Apostolides Arnold, et al., 2004Vinogradov, 2004
Comment MSDC-RI MSDC-RI MSDC-RI MSDC-RI MSDC-RI
Column type CapillaryCapillaryCapillaryCapillaryCapillary
Active phase HP-Innowax FSCHP-Innowax FSCHP-Innowax FSCHP-FFAPInnowax
Column length (m) 60.60.60.30.60.
Carrier gas HeHeHeHeHe
Substrate
Column diameter (mm) 0.250.250.250.250.25
Phase thickness (μm) 0.250.250.25 0.25
Program 60C (10min) => 4C/min => 220C (10min) => 1C/min => 240C60C(10min) => 4C/min => 220C(10min) => 1C/min => 240C60C(10min) => 4C/min => 220C(10min) => 1C/min => 240C(40min)60C (2min) => 5C/min => 160C (1min) => 10C/min => 230C (12min)60C(10min) => 4C/min => 220C(10min) => 1C/min => 240C (20min)
I 1719.1719.1719.1747.1719.
ReferenceDemirci, Baser, et al., 2003Erdemoglu, Sener, et al., 2003Kürkcüoglu, Demirci, et al., 2003Mockute and Judzentiene, 2003Tunaher, Kirimer, et al., 2003
Comment MSDC-RI MSDC-RI MSDC-RI MSDC-RI MSDC-RI
Column type CapillaryCapillaryCapillaryCapillaryCapillary
Active phase HP-InnowaxHP-InnowaxInnowax FSCInnowaxHP-Innowax
Column length (m) 60.60.60.60.60.
Carrier gas  HeHeHeHe
Substrate
Column diameter (mm) 0.250.250.250.250.25
Phase thickness (μm) 0.250.250.250.250.25
Program 60C(10min) => 4C/min => 220C(10min) => 1C/min => 240C60 0C (10 min) 4 K/min -> 220 0C (10 min) 1 K/min -> 240 0C60C(10min) => 4C/min => 220C(10min) => 1C/min => 240C60C(10min) => 4C/min => 220C(10min) => 1C/min => 240C60 0C (10 min) 4 K/min -> 220 0C (10 min) 1 K/min -> 240 0C
I 1719.1719.1719.1719.1719.
ReferenceViljoen, van Vuuren, et al., 2003Baser, Demirci, et al., 2002Baser, Demirei, et al., 2002Baser, Nuriddinov, et al., 2002Demirci, Baser, et al., 2002
Comment MSDC-RI MSDC-RI MSDC-RI MSDC-RI MSDC-RI
Column type CapillaryCapillaryCapillaryCapillaryCapillary
Active phase Supelcowax-10HP-FFAPHP-InnowaxHP-InnowaxHP-Innowax
Column length (m) 60.25.30.60.60.
Carrier gas HeHeH2HeHe
Substrate
Column diameter (mm) 0.250.220.320.250.25
Phase thickness (μm) 0.25 0.50.250.25
Program 40C (7min) => 4C/min => 150C => 8C/min => 240C (10min)60C(2min) => 5C/min => 160C(1min) => 10C/min => 230C(12min)40C (8min) => 3C/min => 180C => 20C/min => 240C60 0C (10 min) 10 K/min -> 220 0C (10 min) 1K/min -> 240 0C60 0C (10 min) 4 K/min -> 220 0C (10 min) 1 K/min -> 240 0C
I 1734.1747.1688.1719.1719.
ReferenceKim and Lee, 2002Mockute and Judzentiene, 2002Paroul, Rota, et al., 2002Baser, Demirci, et al., 2001Gören, Demirci, et al., 2001
Comment MSDC-RI MSDC-RI MSDC-RI MSDC-RI MSDC-RI
Column type CapillaryCapillaryCapillaryCapillaryCapillary
Active phase HP-Innowax FSCHP-InnowaxFFAPRTX-WaxInnowax FSC
Column length (m) 60.60.50.30.60.
Carrier gas HeHe HeHe
Substrate
Column diameter (mm) 0.250.250.20.250.25
Phase thickness (μm) 0.250.250.330.250.25
Program 60C(10min) => 4C/min => 220C(10min) => 1C/min => 240C60C(10min) => 4C/min => 220C(10min) => 1C/min => 240C60C(1min) => 2.5C/min => 115C => 1C/min => 210C(30min)not specified60C(10 min) => 4C/min => 220C(10min) => 1C/min => 240C
I 1719.1719.1689.1656.1719.
ReferenceKirimer N., Tabanea N., et al., 2001Tabanca, Kirimer, et al., 2001Tucker, Maciarello, et al., 2001Kéita, Vincent, et al., 2000Kirimer, Tabanca, et al., 2000
Comment MSDC-RI MSDC-RI MSDC-RI MSDC-RI MSDC-RI
Column type CapillaryCapillaryCapillaryCapillaryCapillary
Active phase DB-WaxInnowax FSCInnowaxDB-WaxDB-Wax
Column length (m) 60.60.60.60.60.
Carrier gas HeliumHelium N2N2
Substrate
Column diameter (mm) 0.320.250.25
Phase thickness (μm) 0.250.250.250.250.25
Program not specified60 0C (10 min) 4 0C/min -> 220 0C (10 min) 1 0C/min -> 240 0C60C(10min) => 4C/min => 220C(10min) => 1C/min => 240Cnot specifiednot specified
I 1698.1719.1718.1711.1715.
ReferencePaniandy, Chane-Ming, et al., 2000Kirimer, Tabanca, et al., 1999Baser, Kürkcüoglu, et al., 1998Weyerstahl, Marschall, et al., 1998Weyerstahl, Marschall, et al., 1998, 2
Comment MSDC-RI MSDC-RI MSDC-RI MSDC-RI MSDC-RI
Column type CapillaryCapillaryCapillaryCapillaryCapillary
Active phase DB-WaxSupelcowaxCarbowax 20MSupelcowax-10NB-351
Column length (m) 60.30. 30.25.
Carrier gas He He
Substrate
Column diameter (mm) 0.250.25 0.250.32
Phase thickness (μm)     0.2
Program 45C(4min) => 30C/min => 60C (5min) => 3C/min => 220C(40min)not specifiednot specifiednot specified40C(5min) => 4C/min => 150C => 8C/min => 240C(12min)
I 1723.1698.1698.1695.1690.
ReferenceZiegleder, 1998Garneau, Bouhajib, et al., 1994Chanegriha and Baaliouamer, 1993Jean, Garneau, et al., 1993Kerrola and Kallio, 1993
Comment MSDC-RI MSDC-RI MSDC-RI MSDC-RI MSDC-RI
Column type CapillaryCapillaryCapillary
Active phase CP-Wax 52CBCarbowax 20MCarbowax 400, Carbowax 20M, Carbowax 1540, Carbowax 4000, Superox 06, PEG 20M, etc.
Column length (m) 50. 50.
Carrier gas   Hydrogen
Substrate
Column diameter (mm) 0.32 0.32
Phase thickness (μm)
Program not specifiednot specifiednot specified
I 1685.1698.1674.
ReferenceVernin, 1991Shibamoto, 1987Waggott and Davies, 1984
Comment MSDC-RI MSDC-RI MSDC-RI

Kovats' RI, non-polar column, custom temperature program

Data compiled by: NIST Mass Spectrometry Data Center, William E. Wallace, director

Column type CapillaryCapillaryCapillaryCapillaryCapillary
Active phase DB-5MSHP-5HP-5BP-1BP-1
Column length (m) 30.30.30.25.25.
Carrier gas HeHeHeN2N2
Substrate
Column diameter (mm) 0.250.250.250.250.32
Phase thickness (μm) 0.250.250.250.250.25
Program 60C(5min) => 2C/min => 140C= 5C/min => 250C(5min)40C(10min) => 3C/min => 200C => 2C/min => 220C40C (3min) => 3C/min => 180C => 30C/min => 270C (5min)60C => 5C/min => 220C (5min) => 3C/min => 245 C (5min)60C => 5C/min => 220C(5min) => 3C/min => 245C(5min)
I 1168.1162.1169.1156.1152.
ReferenceTuberoso, Kowalczyk, et al., 2005Sibanda, Chigwada, et al., 2004Daferera, Ziogas, et al., 2003Khan, Srivastava, et al., 2003Raina, Srivastava, et al., 2003
Comment MSDC-RI MSDC-RI MSDC-RI MSDC-RI MSDC-RI
Column type CapillaryCapillaryCapillaryCapillaryCapillary
Active phase BP-1BP-1DB-5DB-5DB-5
Column length (m) 30.30.30.30.30.
Carrier gas N2N2  He
Substrate
Column diameter (mm) 0.320.320.260.250.25
Phase thickness (μm) 0.250.250.250.250.25
Program 60C => 5.5C/min => 220C => 3.5C/min => 245C60 C 5 C/min -> 220 C (5 min) 3 C/min -> 245 C (5 min)not specified50C(5min) => 2C/min => 250C (60min) => 2C/min => 270C => 1C/min => 290C40C => 2C/min => 60C => 4C/min => 240C
I 1152.1156.1165.1149.1159.
ReferenceRao, Kaul, et al., 2003Khan, Srivastava, et al., 2002Adams, 1998Roscigno, 1998Santos, Andrade, et al., 1998
Comment MSDC-RI MSDC-RI MSDC-RI MSDC-RI MSDC-RI

Kovats' RI, non-polar column, temperature ramp

Data compiled by: NIST Mass Spectrometry Data Center, William E. Wallace, director

Column type CapillaryCapillaryCapillaryCapillaryCapillary
Active phase DB-1DB-5MSHP-5MSDB-5BP-1
Column length (m) 30.30.30.30.25.
Carrier gas HeHeHeHeN2
Substrate
Column diameter (mm) 0.250.250.250.250.32
Phase thickness (μm) 0.250.250.250.250.25
Tstart (C) 50.60.60.60.60.
Tend (C) 280.180.280. 220.
Heat rate (K/min) 5.3.2.3.5.
Initial hold (min) 3. 8.
Final hold (min)  15.30. 13.
I 1150.1171.1166.1168.1163.
ReferenceAllegrone, Belliardo, et al., 2006Angioni, Barra, et al., 2006Hazzit, Baaliouamer, et al., 2006Lucero, Fredrickson, et al., 2006Raina, Verma, et al., 2006
Comment MSDC-RI MSDC-RI MSDC-RI MSDC-RI MSDC-RI
Column type CapillaryCapillaryCapillaryCapillaryCapillary
Active phase BP-1DB-5DB-5HP-5MSDB-5
Column length (m) 30.30.30.30.30.
Carrier gas N2HeHeHeHelium
Substrate
Column diameter (mm) 0.320.260.260.250.25
Phase thickness (μm) 0.250.250.250.250.25
Tstart (C) 60.60.60.50.60.
Tend (C) 220.246.246.250.255.
Heat rate (K/min) 5.3.3.3.3.
Initial hold (min)    10.
Final hold (min) 3.  5.
I 1149.1169.1165.1165.1168.
ReferenceSrivastava, Srivastava, et al., 2006Adams, Morris, et al., 2005Adams and Nguyen, 2005Asuming, Beauchamp, et al., 2005Medina, Lucero, et al., 2005
Comment MSDC-RI MSDC-RI MSDC-RI MSDC-RI MSDC-RI
Column type CapillaryCapillaryCapillaryCapillaryCapillary
Active phase DB-5DB-5MSDB-5HP-5CP Sil 5 CB
Column length (m)  30.30.30.25.
Carrier gas  HeH2HeH2
Substrate
Column diameter (mm)  0.250.250.250.25
Phase thickness (μm)  0.250.250.250.15
Tstart (C) 60.60.40.60.50.
Tend (C) 240.180.280.260.230.
Heat rate (K/min) 3.3.4.3.3.
Initial hold (min)  15.
Final hold (min)   30.
I 1165.1172.1177.1168.1151.
ReferenceShatar S., 2005Angioni, Barra, et al., 2004Avato, Raffo, et al., 2004Lopes, Strobl, et al., 2004Ogunwande, Olawore, et al., 2004
Comment MSDC-RI MSDC-RI MSDC-RI MSDC-RI MSDC-RI
Column type CapillaryCapillaryCapillaryCapillaryCapillary
Active phase CP Sil 8 CBDB-5HP-5MSHP-5DB-5
Column length (m) 30.50.30.30.30.
Carrier gas H2HeHeHeHe
Substrate
Column diameter (mm) 0.250.320.250.250.25
Phase thickness (μm) 0.250.250.251.0.25
Tstart (C) 50.50.50.40.60.
Tend (C) 220.280.280.250.
Heat rate (K/min) 3.5.4.5.3.
Initial hold (min) 2.2.2.1.
Final hold (min)  10.10.
I 1162.1177.1168.1188.1167.
ReferenceSchwob, Bessiere, et al., 2004Baranauskiene, Venskutonis, et al., 2003Baranauskiene, Venskutonis, et al., 2003, 2Bouzouita, Kachouri, et al., 2003Lucero, Estell, et al., 2003
Comment MSDC-RI MSDC-RI MSDC-RI MSDC-RI MSDC-RI
Column type CapillaryCapillaryCapillaryCapillaryCapillary
Active phase CP Sil 5 CBHP-5BP-1SE-30HP-5
Column length (m) 25.30.25.30.30.
Carrier gas H2HeN2HeHe
Substrate
Column diameter (mm) 0.250.250.550.250.25
Phase thickness (μm) 0.150.250.25 0.25
Tstart (C) 50.60.60.60.60.
Tend (C) 230.280.220.240.200.
Heat rate (K/min) 3.3.5.4.4.
Initial hold (min)     1.
Final hold (min)   15. 15.
I 1151.1162.1172.1146.1166.
ReferenceOgunwande, Olawore, et al., 2003Özcan, Tzakou, et al., 2003Srivastava, Ahmad, et al., 2003Juliani, Koroch, et al., 2002Juliani and Simon, 2002
Comment MSDC-RI MSDC-RI MSDC-RI MSDC-RI MSDC-RI
Column type CapillaryCapillaryCapillaryCapillaryCapillary
Active phase CP Sil 5 CBSE-30BP-1BP-1HP-5MS
Column length (m) 25.25.60.25.30.
Carrier gas HeHeN2N2He
Substrate
Column diameter (mm) 0.250.220.320.550.25
Phase thickness (μm)  0.250.250.250.25
Tstart (C) 50.70.60.60.50.
Tend (C) 230.220.220.220.250.
Heat rate (K/min) 3.4.5.5.3.
Initial hold (min)
Final hold (min)    15.
I 1151.1154.1163.1157.1165.
ReferenceKasali, Adio, et al., 2002Palá-Paúl, Velasco-Negueruela, et al., 2002Raina, Lal, et al., 2002Raina, Srivastava, et al., 2002Salido, Altarejos, et al., 2002
Comment MSDC-RI MSDC-RI MSDC-RI MSDC-RI MSDC-RI
Column type CapillaryCapillaryCapillaryCapillaryCapillary
Active phase BP-1SSP-1DB-1DB-1BP-1
Column length (m) 30.30.28.50.25.
Carrier gas N2HeHeN2N2
Substrate
Column diameter (mm) 0.320.320.250.250.55
Phase thickness (μm) 0.250.250.250.250.25
Tstart (C) 60.50.50.80.60.
Tend (C) 220.250.270.225.220.
Heat rate (K/min) 5.2.4.54.5.
Initial hold (min)  2.1.
Final hold (min) 13.5.  15.
I 1152.1140.1166.1147.1149.
ReferenceShawl, Srivastava, et al., 2002Nagarajan, Rao, et al., 2001Nagalakshmi, Thangadurai, et al., 2001Palá-Paúl, Velasco-Negueruela, et al., 2001Raina, Srivastava, et al., 2001
Comment MSDC-RI MSDC-RI MSDC-RI MSDC-RI MSDC-RI
Column type CapillaryCapillaryCapillaryCapillaryCapillary
Active phase DB-1HP-5SE-54DB-5SE-54
Column length (m) 30.30.30.30.30.
Carrier gas HeHeHeHe
Substrate
Column diameter (mm) 0.250.250.260.260.26
Phase thickness (μm) 0.250.250.250.250.25
Tstart (C) 40.60.60.60.60.
Tend (C) 260.280.246.240.246.
Heat rate (K/min) 2.3.3.3.3.
Initial hold (min) 5.
Final hold (min) 20.
I 1142.1162.1165.1165.1165.
ReferenceSenatore and Rigano, 2001Tzakou and Couladis, 2001Adams, 2000Adams, 2000, 2Adams, 2000, 3
Comment MSDC-RI MSDC-RI MSDC-RI MSDC-RI MSDC-RI
Column type CapillaryCapillaryCapillaryCapillaryCapillary
Active phase DB-5Methyl SiliconeHP-5MSDB-5DB-5
Column length (m) 30.30.30.30.30.
Carrier gas HeHeHe He
Substrate
Column diameter (mm) 0.260.320.250.320.26
Phase thickness (μm) 0.250.250.25 0.25
Tstart (C) 60.60.60.50.60.
Tend (C) 246.225.280.250.246.
Heat rate (K/min) 3.2.3.3.3.
Initial hold (min)  2. 5.
Final hold (min)  5.
I 1165.1150.1168.1169.1165.
ReferenceAdams, 2000, 4Jayaprakasha, Rao, et al., 2000Roussis, Tsoukatou, et al., 2000Tzakou, Harvala, et al., 2000Adams, 1999
Comment MSDC-RI MSDC-RI MSDC-RI MSDC-RI MSDC-RI
Column type CapillaryCapillaryCapillaryCapillaryCapillary
Active phase CP Sil 5 CBHP-5Methyl SiliconeBPX-5SPB-1
Column length (m) 25.30.25.50.30.
Carrier gas HeHeN2N2He
Substrate
Column diameter (mm) 0.250.250.50.220.32
Phase thickness (μm)  0.25 0.250.25
Tstart (C) 60.60.60.60.60.
Tend (C) 280.280.220.185.250.
Heat rate (K/min) 5.4.5.2.5.
Initial hold (min)    10.2.
Final hold (min)     5.
I 1156.1163.1155.1164.1167.
ReferenceKaul, Gujral, et al., 1999Sajjadi and Ghassemi, 1999Mallavarapu, Rao, et al., 1998Fournier, Hadjiakhoondi, et al., 1997Jayaprakasha, Jaganmohan Rao, et al., 1997
Comment MSDC-RI MSDC-RI MSDC-RI MSDC-RI MSDC-RI
Column type CapillaryCapillaryCapillary
Active phase DB-5SE-30OV-101
Column length (m) 30.25.25.
Carrier gas HeN2N2
Substrate
Column diameter (mm) 0.250.20.25
Phase thickness (μm) 0.25
Tstart (C) 60.60.50.
Tend (C) 240.180.200.
Heat rate (K/min) 3.3.5.
Initial hold (min)  10.
Final hold (min)  1.
I 1165.1154.1159.
ReferenceTellez, Estell, et al., 1997Jantan, Ali, et al., 1995Menut, Molangui, et al., 1995
Comment MSDC-RI MSDC-RI MSDC-RI

Van Den Dool and Kratz RI, non-polar column, custom temperature program

Data compiled by: NIST Mass Spectrometry Data Center, William E. Wallace, director

Column type CapillaryCapillaryCapillaryCapillaryCapillary
Active phase VF-5MSHP-5MSDB-5SE-52HP-5MS
Column length (m) 30.30. 30.30.
Carrier gas HeHe HeHe
Substrate
Column diameter (mm) 0.250.25 0.320.25
Phase thickness (μm) 0.250.25 0.150.25
Program Multi-step temperature program; T(initial)=60C; T(final)=270C50C(4min) => 10C/min => 200C(0.5min) => 20C/min => 260C(5min)not specified45C => 1C/min => 100C => 5C/min => 250C(10min)50C (3min) => 3C/min => 200C => 6C/min => 240C
I 1199.1164.1162.1169.1169.
ReferenceTret'yakov, 2008Pérez, Navarro, et al., 2007Özel, Gögüs, et al., 2006Sacchetti, Guerrini, et al., 2006Akpulat, Tepe, et al., 2005
Comment MSDC-RI MSDC-RI MSDC-RI MSDC-RI MSDC-RI
Column type CapillaryCapillaryCapillaryCapillaryCapillary
Active phase HP-55 % Phenyl methyl siloxaneSPB-1SE-52CP Sil 8 CB
Column length (m) 30.30.50.30.50.
Carrier gas HeHe HeHe
Substrate Chromosorb W
Column diameter (mm) 0.320.320.250.520.32
Phase thickness (μm) 0.250.150.250.15
Program 80 0C 8 K/min -> 150 0C 5 K/min -> 230 0C (10 min)45C => 1C/min => 100C => 5C/min => 250C (10min)70C(3min) => 4C/min => 120C => 8C/min => 250C45C => 1C/min => 100C => 5C/min => 250C (10min)60C (2min) => 5C/min => 160C (1min) => 10C/min => 250C (2min)
I 1146.1169.1153.1169.1165.
ReferenceGopanraj, Dan, et al., 2005Sacchetti, Maietti, et al., 2005Díaz-Maroto, Sánchez Palomo, et al., 2004Sacchetti, Medici, et al., 2004Mockute and Judzentiene, 2003
Comment MSDC-RI MSDC-RI MSDC-RI MSDC-RI MSDC-RI
Column type CapillaryCapillary
Active phase BP-1SE-52
Column length (m) 50.60.
Carrier gas  He
Substrate
Column diameter (mm) 0.220.32
Phase thickness (μm) 0.250.40
Program not specified45 C (6 min) 3 C/min -> 111 0C 2 C/min -> 160 C 3 C/min -> 300 C (15 min)
I 1150.1168.
ReferenceCavalli, Ranarivelo, et al., 2001Mondello, Dugo, et al., 1995
Comment MSDC-RI MSDC-RI

References

Yamada, 1941
Yamada, S.,
Researches on camphor, borneol and their allied substances,
Bull. Chem. Soc. Jpn., 1941, 16, 187-196. [all data]
Lecat, 1926
Lecat, M.,
New binary azeotropes: 3rd list,
Ann. Soc. Sci. Bruxelles, Ser. B, 1926, 45, 284-94. [all data]
Pirsch, 1932
Pirsch, J.,
Microdetermination of Molecular Weight by the Method of Melting-point Depression,
Chem. Ber., 1932, 65B, 862-5. [all data]
Buechner, 1906
Buechner, E.H.,
Z. Phys. Chem., Stoechiom. Verwandtschaftsl., 1906, 54, 665. [all data]