2-Trifluoromethyl-2-propanol
- Formula: C4H7F3O
- Molecular weight: 128.0930
- IUPAC Standard InChIKey: OCGWWLDZAFOHGD-UHFFFAOYSA-N
- CAS Registry Number: 507-52-8
- Chemical structure:
View 3d structure (requires JavaScript / HTML 5) - Other names: 2-Trifluoromethylpropanol-2; 2-Propanol, 1,1,1-trifluoro-2-methyl-; 1,1,1-trifluoro-2-methylpropan-2-ol

Phase change data

Data compiled by: Robert L. Brown and Stephen E. Stein
Quantity | Value | Units | Method | Reference | Comment |
---|---|---|---|---|---|
Tboil | 353. to 354. | K | N/A | PCR Inc., 1990 |

Reaction thermochemistry data

Data compiled by: John E. Bartmess
Individual Reactions
C4H6F3O- + =
By formula: C4H6F3O- + H+ = C4H7F3O
Quantity | Value | Units | Method | Reference | Comment |
---|---|---|---|---|---|
ΔrH° | 1507. ± 8.8 | kJ/mol | G+TS | Caldwell, McMahon, et al., 1985 | gas phase; value altered from reference due to change in acidity scale |
Quantity | Value | Units | Method | Reference | Comment |
ΔrG° | 1479. ± 8.4 | kJ/mol | IMRE | Caldwell, McMahon, et al., 1985 | gas phase; value altered from reference due to change in acidity scale |

Gas phase ion energetics data

Data compiled by: John E. Bartmess
De-protonation reactions
C4H6F3O- + =
By formula: C4H6F3O- + H+ = C4H7F3O
Quantity | Value | Units | Method | Reference | Comment |
---|---|---|---|---|---|
ΔrH° | 1507. ± 8.8 | kJ/mol | G+TS | Caldwell, McMahon, et al., 1985 | gas phase; value altered from reference due to change in acidity scale |
Quantity | Value | Units | Method | Reference | Comment |
ΔrG° | 1479. ± 8.4 | kJ/mol | IMRE | Caldwell, McMahon, et al., 1985 | gas phase; value altered from reference due to change in acidity scale |

References

PCR Inc., 1990
PCR Inc.,
Research Chemicals Catalog 1990-1991, PCR Inc., Gainesville, FL, 1990, 1. [all data]
Caldwell, McMahon, et al., 1985
Caldwell, G.; McMahon, T.B.; Kebarle, P.; Bartmess, J.E.; Kiplinger, J.P.,
Methyl substituent effects in the gas phase acidities of halosubstituted oxygen acids. A realignment with substituent effects in solution,
J. Am. Chem. Soc., 1985, 107, 80. [all data]