Butane, 2,3-dichloro-2-methyl-
- Formula: C5H10Cl2
- Molecular weight: 141.039
- IUPAC Standard InChIKey: TXTORVZCRUFBBO-UHFFFAOYSA-N
- CAS Registry Number: 507-45-9
- Chemical structure:
View 3d structure (requires JavaScript / HTML 5) - Other names: Amylene dichloride; 2,3-Dichloro-2-methylbutane

Reaction thermochemistry data

Data compiled by: Hussein Y. Afeefy, Joel F. Liebman, and Stephen E. Stein
Individual Reactions
By formula: C5H10Cl2 = C5H9Cl + HCl
Quantity | Value | Units | Method | Reference | Comment |
---|---|---|---|---|---|
ΔrH° | 68. ± 1. | kJ/mol | Eqk | Meged, Levanova, et al., 1980 | gas phase |
ΔrH° | 68.2 ± 4.2 | kJ/mol | Eqk | Meged, Levanova, et al., 1980 | gas phase |

Normal alkane RI, non-polar column, isothermal

Column type | Active phase | Temperature (C) | I | Reference | Comment |
---|---|---|---|---|---|
Capillary | Squalane | 50. | 790. | Tourres, 1968 | Nitrogen; Column length: 50. m; Column diameter: 0.25 mm |
Capillary | Squalane | 70. | 796. | Tourres, 1968 | Nitrogen; Column length: 50. m; Column diameter: 0.25 mm |

Normal alkane RI, non-polar column, custom temperature program

Column type | Active phase | I | Reference | Comment |
---|---|---|---|---|
Capillary | Polydimethyl siloxanes | 844. | Zenkevich, Chupalov, et al., 1996 | Program: not specified |

References

Meged, Levanova, et al., 1980
Meged, V.M.; Levanova, S.V.; Rozhnov, A.M.,
Dehydrohalogenation of dihalomethylbutanes. 2.,
Izv. Vyssh. Uchebn. Zaved., Khim. Khim. Tekhnol., 1980, 23, 149-151. [all data]
Tourres, 1968
Tourres, D.A.,
Separation of mono- and dichloro-methyl butanes and of monochloro-methyl butenes by preparative gas chromatography,
Chromatographia, 1968, 1, 11-12, 437-442, https://doi.org/10.1007/BF02255759
. [all data]
Zenkevich, Chupalov, et al., 1996
Zenkevich, I.G.; Chupalov, A.A.; Herzschuh, R.,
Correlation of the Increments of Gas Chromatographic Retention Indices with the Differences of Innermolecular Energies of Reagents and Products of Chemical Reactions,
Zh. Org. Khim. (Rus.), 1996, 32, 11, 1685-1691. [all data]