2,2,2-tribromoethane-1,1-diol
- Formula: C2H3Br3O2
- Molecular weight: 298.756
- IUPAC Standard InChIKey: PRRAIFVGYHJQKX-UHFFFAOYSA-N
- CAS Registry Number: 507-42-6
- Chemical structure:
View 3d structure (requires JavaScript / HTML 5) - Other names: tribromoethanal hydrate

Phase change data

Data compiled by: Thermodynamics Research Center, NIST Boulder Laboratories, Chris Muzny director
Quantity | Value | Units | Method | Reference | Comment |
---|---|---|---|---|---|
Tfus | 319.15 | K | N/A | Bruner, 1894 | Uncertainty assigned by TRC = 0.7 K |

References

Bruner, 1894
Bruner, L.,
The heats of fusion of some organic compounds,
Ber. Dtsch. Chem. Ges., 1894, 27, 2102. [all data]