Butane, 2-bromo-2-methyl-
- Formula: C5H11Br
- Molecular weight: 151.045
- IUPAC Standard InChIKey: JOUWCKCVTDSMHF-UHFFFAOYSA-N
- CAS Registry Number: 507-36-8
- Chemical structure:
View 3d structure (requires JavaScript / HTML 5) - Other names: tert-Amyl bromide; tert-Pentyl bromide; 2-Bromo-2-methylbutane; 2-Methyl-2-bromobutane

Phase change data

Data compiled as indicated in comments:
BS - Robert L. Brown and Stephen E. Stein
AC - William E. Acree, Jr., James S. Chickos
Quantity | Value | Units | Method | Reference | Comment |
---|---|---|---|---|---|
Tboil | 380. | K | N/A | American Tokyo Kasei, 1988 | BS |
Reduced pressure boiling point
Tboil (K) | Pressure (bar) | Reference | Comment |
---|---|---|---|
380.2 | 0.980 | Aldrich Chemical Company Inc., 1990 | BS |
Enthalpy of vaporization
ΔvapH (kJ/mol) | Temperature (K) | Method | Reference | Comment |
---|---|---|---|---|
36.4 | 310. | A | Stephenson and Malanowski, 1987 | Based on data from 295. to 422. K. See also Dykyj, 1972.; AC |

Kovats' RI, polar column, isothermal

View large format table.

Column type Active phase Temperature (C) I Reference Comment
PackedCarbowax 20M100.937.Castello and D'Amato, 1985He, Chromosorb W AW DMCS; Column length: 3. m
PackedCarbowax 20M125.939.Castello and D'Amato, 1985He, Chromosorb W AW DMCS; Column length: 3. m
PackedCarbowax 20M75.925.Castello and D'Amato, 1985He, Chromosorb W AW DMCS; Column length: 3. m

Normal alkane RI, non-polar column, isothermal

View large format table.

Column type Active phase Temperature (C) I Reference Comment
CapillaryApiezon L130.750.Arruda, Junkes, et al., 2008

Normal alkane RI, non-polar column, custom temperature program

View large format table.

Column type Active phase I Reference Comment
CapillaryOV-1, SE-30, Methyl silicone, SP-2100, OV-101, DB-1, etc.734.Waggott and Davies, 1984Hydrogen; Column length: 50. m; Column diameter: 0.32 mm; Program: not specified

References

American Tokyo Kasei, 1988
American Tokyo Kasei,
TCI American Organic Chemical 88/89 Catalog, American Tokyo Kasei, Portland, OR, 1988, 1610. [all data]
Aldrich Chemical Company Inc., 1990
Aldrich Chemical Company Inc.,
Catalog Handbook of Fine Chemicals, Aldrich Chemical Company, Inc., Milwaukee WI, 1990, 1. [all data]
Stephenson and Malanowski, 1987
Stephenson, Richard M.; Malanowski, Stanislaw,
Handbook of the Thermodynamics of Organic Compounds, 1987, https://doi.org/10.1007/978-94-009-3173-2
. [all data]
Dykyj, 1972
Dykyj, J.,
Petrochemia, 1972, 12, 1, 13. [all data]