Propane, 2-bromo-2-methyl-
- Formula: C4H9Br
- Molecular weight: 137.018
- IUPAC Standard InChIKey: RKSOPLXZQNSWAS-UHFFFAOYSA-N
- CAS Registry Number: 507-19-7
- Chemical structure:
View 3d structure (requires JavaScript / HTML 5) - Other names: tert-Butyl bromide; Trimethylbromomethane; 2-Bromo-2-methylpropane; 2-Bromoisobutane; tert-C4H9Br; t-Butyl bromide; Bromotrimethylmethane; Tertiarybutyl bromide; Butylbromide, tert-; 1,1-Dimethylethyl bromide; 2-Methyl-2-bromopropane; NSC 8418

Gas phase thermochemistry data

Data compiled by: Hussein Y. Afeefy, Joel F. Liebman, and Stephen E. Stein
Quantity | Value | Units | Method | Reference | Comment |
---|---|---|---|---|---|
ΔfH°gas | -132.4 ± 1.5 | kJ/mol | Eqk | Howlett, 1957 | Reanalyzed by Cox and Pilcher, 1970, Original value = -127.5 kJ/mol |

Reaction thermochemistry data

Data compiled as indicated in comments:
B - John E. Bartmess
M - Michael M. Meot-Ner (Mautner) and Sharon G. Lias
RCD - Robert C. Dunbar
ALS - Hussein Y. Afeefy, Joel F. Liebman, and Stephen E. Stein
Individual Reactions
By formula: Br- + C4H9Br = (Br- • C4H9Br)
Quantity | Value | Units | Method | Reference | Comment |
---|---|---|---|---|---|
ΔrH° | 65.3 ± 4.2 | kJ/mol | TDAs | Li, Ross, et al., 1996 | gas phase; B |
ΔrH° | 51.88 | kJ/mol | TDAs | Dougherty, 1974 | gas phase; B,M |
Quantity | Value | Units | Method | Reference | Comment |
ΔrS° | 80.8 | J/mol*K | HPMS | Dougherty, 1974 | gas phase; M |
Quantity | Value | Units | Method | Reference | Comment |
ΔrG° | 30.5 ± 0.84 | kJ/mol | TDAs | Li, Ross, et al., 1996 | gas phase; B |
ΔrG° | 28.0 | kJ/mol | TDAs | Dougherty, 1974 | gas phase; B |
By formula: F- + C4H9Br = (F- • C4H9Br)
Quantity | Value | Units | Method | Reference | Comment |
---|---|---|---|---|---|
ΔrH° | 93.3 ± 8.4 | kJ/mol | IMRE | Larson and McMahon, 1983 | gas phase; B |
Quantity | Value | Units | Method | Reference | Comment |
ΔrG° | 64.0 ± 8.4 | kJ/mol | IMRE | Larson and McMahon, 1983 | gas phase; B |
By formula: Cl- + C4H9Br = (Cl- • C4H9Br)
Quantity | Value | Units | Method | Reference | Comment |
---|---|---|---|---|---|
ΔrH° | 74.1 ± 4.2 | kJ/mol | TDAs | Li, Ross, et al., 1996 | gas phase; B |
Quantity | Value | Units | Method | Reference | Comment |
ΔrG° | 37.2 ± 0.84 | kJ/mol | TDAs | Li, Ross, et al., 1996 | gas phase; B |
By formula: Na+ + C4H9Br = (Na+ • C4H9Br)
Free energy of reaction
ΔrG° (kJ/mol) | T (K) | Method | Reference | Comment |
---|---|---|---|---|
57.3 | 298. | IMRE | McMahon and Ohanessian, 2000 | Anchor alanine=39.89; RCD |
By formula: C4H9Br = C4H8 + HCl
Quantity | Value | Units | Method | Reference | Comment |
---|---|---|---|---|---|
ΔrH° | 79. ± 4. | kJ/mol | Eqk | Kistiakowsky and Stauffer, 1937 | gas phase; ALS |
By formula: HBr + C4H8 = C4H9Br
Quantity | Value | Units | Method | Reference | Comment |
---|---|---|---|---|---|
ΔrH° | -78.868 | kJ/mol | Eqk | Howlett, 1957 | gas phase; ALS |
By formula: C4H9Br = C4H9Br
Quantity | Value | Units | Method | Reference | Comment |
---|---|---|---|---|---|
ΔrH° | 19.0 | kJ/mol | Eqk | Nesterova and Rozhnov, 1974 | gas phase; ALS |

Henry's Law data

Data compiled by: Rolf Sander
Henry's Law constant (water solution)
kH(T) = k°H exp(d(ln(kH))/d(1/T) ((1/T) - 1/(298.15 K)))
k°H = Henry's law constant for solubility in water at 298.15 K (mol/(kg*bar))
d(ln(kH))/d(1/T) = Temperature dependence constant (K)
k°H (mol/(kg*bar)) | d(ln(kH))/d(1/T) (K) | Method | Reference | Comment |
---|---|---|---|---|
0.031 | Q | N/A | missing citation give several references for the Henry's law constants but don't assign them to specific species. Value at T = 291. K. |

Kovats' RI, non-polar column, isothermal

Column type | Active phase | Temperature (C) | I | Reference | Comment |
---|---|---|---|---|---|
Packed | Squalane | 27. | 595. | Hively and Hinton, 1968 | He, Chromosorb P; Column length: 15. m; Column diameter: 0.25 mm |
Packed | Squalane | 49. | 600. | Hively and Hinton, 1968 | He, Chromosorb P; Column length: 15. m; Column diameter: 0.25 mm |
Packed | Squalane | 67. | 603. | Hively and Hinton, 1968 | He, Chromosorb P; Column length: 15. m; Column diameter: 0.25 mm |
Packed | Apiezon L | 130. | 632. | von Kováts, 1958 | Celite (40:60 Gewichtsverhaltnis) |
Packed | Apiezon L | 70. | 619. | von Kováts, 1958 | Celite (40:60 Gewichtsverhaltnis) |

Van Den Dool and Kratz RI, non-polar column, temperature ramp

Column type | Active phase | I | Reference | Comment |
---|---|---|---|---|
Capillary | SE-54 | 623. | Weber, 1986 | 25. m/0.31 mm/0.17 μm, H2, 2. K/min; Tstart: 35. C |

Normal alkane RI, non-polar column, isothermal

Column type | Active phase | Temperature (C) | I | Reference | Comment |
---|---|---|---|---|---|
Capillary | Apiezon L | 130. | 633. | Arruda, Junkes, et al., 2008 |

Normal alkane RI, non-polar column, custom temperature program

Column type | Active phase | I | Reference | Comment |
---|---|---|---|---|
Capillary | Methyl Silicone | 615. | Zenkevich and Marinichev, 2001 | Program: not specified |

Condensed phase thermochemistry data

Data compiled as indicated in comments:
ALS - Hussein Y. Afeefy, Joel F. Liebman, and Stephen E. Stein
DH - Eugene S. Domalski and Elizabeth D. Hearing
Quantity | Value | Units | Method | Reference | Comment |
---|---|---|---|---|---|
ΔfH°liquid | -31.89 | kcal/mol | Eqk | Nesterova and Rozhnov, 1974 | ALS |
ΔfH°liquid | -39.2 | kcal/mol | Cm | Holm, 1973 | Grignard Rx; ALS |
Constant pressure heat capacity of liquid
Cp,liquid (cal/mol*K) | Temperature (K) | Reference | Comment |
---|---|---|---|
39.60 | 298.15 | Shehatta, 1993 | DH |

Phase change data

Data compiled as indicated in comments:
BS - Robert L. Brown and Stephen E. Stein
TRC - Thermodynamics Research Center, NIST Boulder Laboratories, Chris Muzny director
AC - William E. Acree, Jr., James S. Chickos
ALS - Hussein Y. Afeefy, Joel F. Liebman, and Stephen E. Stein
CAL - James S. Chickos, William E. Acree, Jr., Joel F. Liebman, Students of Chem 202 (Introduction to the Literature of Chemistry), University of Missouri -- St. Louis
Quantity | Value | Units | Method | Reference | Comment |
---|---|---|---|---|---|
Tboil | 346.4 | K | N/A | Weast and Grasselli, 1989 | BS |
Tboil | 348. | K | N/A | American Tokyo Kasei, 1988 | BS |
Tboil | 346.4 | K | N/A | Majer and Svoboda, 1985 | |
Tboil | 346. | K | N/A | Kornblum, Smiley, et al., 1955 | Uncertainty assigned by TRC = 2. K; TRC |
Tboil | 346.1 | K | N/A | Kushner, Crowe, et al., 1950 | Uncertainty assigned by TRC = 0.3 K; TRC |
Quantity | Value | Units | Method | Reference | Comment |
Tfus | 256.95 | K | N/A | Timmermans, 1952 | Uncertainty assigned by TRC = 0.4 K; TRC |
Tfus | 256.2 | K | N/A | Kushner, Crowe, et al., 1950 | Crystal phase 1 phase; Uncertainty assigned by TRC = 0.2 K; TRC |
Tfus | 146. | K | N/A | Timmermans, 1935 | Uncertainty assigned by TRC = 3. K; TRC |
Tfus | 246.05 | K | N/A | Timmermans, 1934 | Uncertainty assigned by TRC = 0.3 K; TRC |
Quantity | Value | Units | Method | Reference | Comment |
ΔvapH° | 7.631 | kcal/mol | N/A | Majer and Svoboda, 1985 | |
ΔvapH° | 7.4 | kcal/mol | N/A | Boublik, Fried, et al., 1984 | Based on data from 270. to 345. K. See also Basarová and Svoboda, 1991.; AC |
ΔvapH° | 7.60 ± 0.02 | kcal/mol | C | Wadsö, Luoma, et al., 1968 | AC |
ΔvapH° | 7.603 ± 0.029 | kcal/mol | C | Wadso, 1968 | ALS |
ΔvapH° | 7.40 ± 0.20 | kcal/mol | V | Bryce-Smith and Howlett, 1951 | ALS |
Enthalpy of vaporization
ΔvapH (kcal/mol) | Temperature (K) | Method | Reference | Comment |
---|---|---|---|---|
6.986 | 346.4 | N/A | Majer and Svoboda, 1985 | |
7.50 | 263. | A | Stephenson and Malanowski, 1987 | Based on data from 248. to 346. K.; AC |
7.53 | 313. | N/A | Calero, Valle, et al., 1969 | Based on data from 298. to 323. K.; AC |
7.46 | 288. | N/A | Hull, Campbell, et al., 1951 | Based on data from 273. to 346. K. See also Boublik, Fried, et al., 1984.; AC |
Antoine Equation Parameters
log10(P) = A − (B / (T + C))
P = vapor pressure (atm)
T = temperature (K)
View plot Requires a JavaScript / HTML 5 canvas capable browser.
Temperature (K) | A | B | C | Reference | Comment |
---|---|---|---|---|---|
273. to 346.0 | 4.55874 | 1539.717 | -8.195 | Bryce-Smith and Howlett, 1951, 2 | Coefficents calculated by NIST from author's data. |
Enthalpy of fusion
ΔfusH (kcal/mol) | Temperature (K) | Reference | Comment |
---|---|---|---|
0.471 | 256.1 | Domalski and Hearing, 1996 | AC |
Entropy of fusion
ΔfusS (cal/mol*K) | Temperature (K) | Reference | Comment |
---|---|---|---|
6.472 | 208.6 | Domalski and Hearing, 1996 | CAL |
1.08 | 231.5 | ||
1.84 | 256.1 |

Gas phase ion energetics data

Data evaluated as indicated in comments:
L - Sharon G. Lias
Data compiled as indicated in comments:
LL - Sharon G. Lias and Joel F. Liebman
LLK - Sharon G. Lias, Rhoda D. Levin, and Sherif A. Kafafi
RDSH - Henry M. Rosenstock, Keith Draxl, Bruce W. Steiner, and John T. Herron
Quantity | Value | Units | Method | Reference | Comment |
---|---|---|---|---|---|
IE (evaluated) | 9.92 ± 0.03 | eV | N/A | N/A | L |
Ionization energy determinations
IE (eV) | Method | Reference | Comment |
---|---|---|---|
9.95 | EST | Luo and Pacey, 1992 | LL |
9.95 ± 0.015 | PE | Hashmall and Heilbronner, 1970 | RDSH |
9.89 ± 0.03 | PI | Watanabe, Nakayama, et al., 1962 | RDSH |
9.95 | PE | Kimura, Katsumata, et al., 1981 | Vertical value; LLK |
10.05 | PE | Flamini, Semprini, et al., 1976 | Vertical value; LLK |
Appearance energy determinations
Ion | AE (eV) | Other Products | Method | Reference | Comment |
---|---|---|---|---|---|
C4H9+ | 9.85 ± 0.01 | Br | PI | McLoughlin and Traeger, 1979 | LLK |

Ion clustering data

Data compiled as indicated in comments:
B - John E. Bartmess
M - Michael M. Meot-Ner (Mautner) and Sharon G. Lias
RCD - Robert C. Dunbar
Clustering reactions
By formula: Br- + C4H9Br = (Br- • C4H9Br)
Quantity | Value | Units | Method | Reference | Comment |
---|---|---|---|---|---|
ΔrH° | 15.6 ± 1.0 | kcal/mol | TDAs | Li, Ross, et al., 1996 | gas phase; B |
ΔrH° | 12.40 | kcal/mol | TDAs | Dougherty, 1974 | gas phase; B,M |
Quantity | Value | Units | Method | Reference | Comment |
ΔrS° | 19.3 | cal/mol*K | HPMS | Dougherty, 1974 | gas phase; M |
Quantity | Value | Units | Method | Reference | Comment |
ΔrG° | 7.30 ± 0.20 | kcal/mol | TDAs | Li, Ross, et al., 1996 | gas phase; B |
ΔrG° | 6.70 | kcal/mol | TDAs | Dougherty, 1974 | gas phase; B |
By formula: Cl- + C4H9Br = (Cl- • C4H9Br)
Quantity | Value | Units | Method | Reference | Comment |
---|---|---|---|---|---|
ΔrH° | 17.7 ± 1.0 | kcal/mol | TDAs | Li, Ross, et al., 1996 | gas phase; B |
Quantity | Value | Units | Method | Reference | Comment |
ΔrG° | 8.90 ± 0.20 | kcal/mol | TDAs | Li, Ross, et al., 1996 | gas phase; B |
By formula: F- + C4H9Br = (F- • C4H9Br)
Quantity | Value | Units | Method | Reference | Comment |
---|---|---|---|---|---|
ΔrH° | 22.3 ± 2.0 | kcal/mol | IMRE | Larson and McMahon, 1983 | gas phase; B |
Quantity | Value | Units | Method | Reference | Comment |
ΔrG° | 15.3 ± 2.0 | kcal/mol | IMRE | Larson and McMahon, 1983 | gas phase; B |
By formula: Na+ + C4H9Br = (Na+ • C4H9Br)
Free energy of reaction
ΔrG° (kcal/mol) | T (K) | Method | Reference | Comment |
---|---|---|---|---|
13.7 | 298. | IMRE | McMahon and Ohanessian, 2000 | Anchor alanine=39.89; RCD |

References

Howlett, 1957
Howlett, K.E.,
The use of equilibrium constants to calculate thermodynamic quantities. Part III. Equilibria in the system tert.-butyl bromideisobutene-hydrogen bromide,
J. Chem. Soc., 1957, 2834-2836. [all data]
Cox and Pilcher, 1970
Cox, J.D.; Pilcher, G.,
Thermochemistry of Organic and Organometallic Compounds, Academic Press, New York, 1970, 1-636. [all data]
Li, Ross, et al., 1996
Li, C.; Ross, P.; Szulejko, J.; McMahon, T.B.,
High-Pressure Mass Spectrometric Investigations of the Potential Energy Surfaces of Gas-Phase Sn2 Reactions.,
J. Am. Chem. Soc., 1996, 118, 39, 9360, https://doi.org/10.1021/ja960565o
. [all data]
Dougherty, 1974
Dougherty, R.C.,
SN2 reactions in the gas phase. Alkyl group structural effects,
Org. Mass Spectrom., 1974, 8, 85. [all data]
Larson and McMahon, 1983
Larson, J.W.; McMahon, T.B.,
Strong hydrogen bonding in gas-phase anions. An ion cyclotron resonance determination of fluoride binding energetics to bronsted acids from gas-phase fluoride exchange equilibria measurements,
J. Am. Chem. Soc., 1983, 105, 2944. [all data]
McMahon and Ohanessian, 2000
McMahon, T.B.; Ohanessian, G.,
An Experimental and Ab Initio Study of the Nature of the Binding in Gas-Phase Complexes of Sodium Ions,
Chem. Eur. J., 2000, 6, 16, 2931, https://doi.org/10.1002/1521-3765(20000818)6:16<2931::AID-CHEM2931>3.0.CO;2-7
. [all data]
Kistiakowsky and Stauffer, 1937
Kistiakowsky, G.B.; Stauffer, C.H.,
The kinetics of gaseous addition of halogen acids to isobutene, 1937, 165-170. [all data]
Nesterova and Rozhnov, 1974
Nesterova, T.N.; Rozhnov, A.M.,
Isomerization of isostructural monobromobutanes,
Izv. Vyssh. Uchebn. Zaved., Khim. Khim. Tekhnol., 1974, 17, 556-558. [all data]
Hively and Hinton, 1968
Hively, R.A.; Hinton, R.E.,
Variation of the retention index with temperature on squalane substrates,
J. Gas Chromatogr., 1968, 6, 4, 203-217, https://doi.org/10.1093/chromsci/6.4.203
. [all data]
von Kováts, 1958
von Kováts, E.,
206. Gas-chromatographische Charakterisierung organischer Verbindungen. Teil 1: Retentionsindices aliphatischer Halogenide, Alkohole, Aldehyde und Ketone,
Helv. Chim. Acta, 1958, 41, 7, 1915-1932, https://doi.org/10.1002/hlca.19580410703
. [all data]
Weber, 1986
Weber, L.,
Utilization of the Sadtler standard RI system in micropollution analyses,
J. Hi. Res. Chromatogr. Chromatogr. Comm., 1986, 9, 8, 446-451, https://doi.org/10.1002/jhrc.1240090806
. [all data]
Arruda, Junkes, et al., 2008
Arruda, A.C.S.; Junkes, B. da.S.; Souza, E.S.; Yunes, R.A.; Heizen, V.E.F.,
Semi-Emlirical Topological Index to Predict Properties of Halogenated Aliphatic Compounds,
J. Chemometrics, 2008, 22, 3-4, 186-194, https://doi.org/10.1002/cem.1121
. [all data]
Zenkevich and Marinichev, 2001
Zenkevich, I.G.; Marinichev, A.N.,
Comparison of Topological and Dynamics Molecular Characteristics for Precalculation of Chromatographic Retention Parameters of Organic Compounds (in Russian),
Zh. Struct. Khim., 2001, 42, 5, 893-902. [all data]