C12H5F5N2O2

Reaction thermochemistry data

Data compiled by: John E. Bartmess

Individual Reactions

C12H4F5N2O2- + Hydrogen cation = C12H5F5N2O2

By formula: C12H4F5N2O2- + H+ = C12H5F5N2O2

Quantity Value Units Method Reference Comment
Δr315.5 ± 2.0kcal/molIMREKoppel, Koppel, et al., 1998gas phase

References

Koppel, Koppel, et al., 1998
Koppel, I.; Koppel, J.; Maria, P.C.; Gal, J.F.; Notario, R.; Vlasov, V.M.; Taft, R.W., Comparison of Bronsted acidities of neutral NH-acids in gas phase, dimethyl sulfoxide and water, Int. J. Mass Spectrom., 1998, 175, 1-2, 61-69, https://doi.org/10.1016/S0168-1176(98)00113-X . [all data]