guanidinium nitrate
- Formula: CH6N4O3
- Molecular weight: 122.0833
- IUPAC Standard InChIKey: CNUNWZZSUJPAHX-UHFFFAOYSA-N
- CAS Registry Number: 506-93-4
- Chemical structure:
View 3d structure (requires JavaScript / HTML 5) - Other names: guanidine nitrate

Phase change data

Data compiled by: Thermodynamics Research Center, NIST Boulder Laboratories, Chris Muzny director
Quantity | Value | Units | Method | Reference | Comment |
---|---|---|---|---|---|
Tfus | 487.35 | K | N/A | Witschonke, 1954 | Uncertainty assigned by TRC = 0.2 K |
Tfus | 487.85 | K | N/A | Witschonke, 1954 | Uncertainty assigned by TRC = 0.1 K |

References

Witschonke, 1954
Witschonke, C.R.,
Freezing point and purity data for some organic compounds,
Anal. Chem., 1954, 26, 562-4. [all data]