D-Ribose
- Formula: C5H10O5
- Molecular weight: 150.1299
- IUPAC Standard InChIKey: PYMYPHUHKUWMLA-LMVFSUKVSA-N
- CAS Registry Number: 50-69-1
- Chemical structure:
View 3d structure (requires JavaScript / HTML 5) - Stereoisomers:
- Other names: Ribose, D-; Ribose
- Comments:
- Although only a single structure is shown, this species may exist in several forms including a linear molecule, a five membered ring and a six membered ring.

Condensed phase thermochemistry data

Data compiled as indicated in comments:
ALS - Hussein Y. Afeefy, Joel F. Liebman, and Stephen E. Stein
DH - Eugene S. Domalski and Elizabeth D. Hearing
Quantity | Value | Units | Method | Reference | Comment |
---|---|---|---|---|---|
ΔfH°solid | -1049.1 ± 1.1 | kJ/mol | Ccb | Gubareva, Kunderenko, et al., 1991 | ALS |
ΔfH°solid | -1047.2 ± 1.7 | kJ/mol | Ccr | Colbert, Domalski, et al., 1987 | ALS |
ΔfH°solid | -1050.9 ± 0.71 | kJ/mol | Ccb | Desai and Wilhoit, 1970 | ALS |
Quantity | Value | Units | Method | Reference | Comment |
ΔcH°solid | -2347.59 ± 0.91 | kJ/mol | Ccb | Gubareva, Kunderenko, et al., 1991 | Corresponding ΔfHºsolid = -1049.11 kJ/mol (simple calculation by NIST; no Washburn corrections); ALS |
ΔcH°solid | -2349.47 ± 0.95 | kJ/mol | Ccr | Colbert, Domalski, et al., 1987 | Corresponding ΔfHºsolid = -1047.23 kJ/mol (simple calculation by NIST; no Washburn corrections); ALS |
ΔcH°solid | -2345.8 ± 0.63 | kJ/mol | Ccb | Desai and Wilhoit, 1970 | Corresponding ΔfHºsolid = -1050.9 kJ/mol (simple calculation by NIST; no Washburn corrections); ALS |
ΔcH°solid | -2334.2 ± 4.6 | kJ/mol | Ccb | Stroh and Fincke, 1963 | Corresponding ΔfHºsolid = -1062.5 kJ/mol (simple calculation by NIST; no Washburn corrections); ALS |
Constant pressure heat capacity of solid
Cp,solid (J/mol*K) | Temperature (K) | Reference | Comment |
---|---|---|---|
187. | 303. | Kawaizumi, Kushida, et al., 1981 | T = 300 to 315 K.; DH |

Reaction thermochemistry data

Data compiled as indicated in comments:
RCD - Robert C. Dunbar
ALS - Hussein Y. Afeefy, Joel F. Liebman, and Stephen E. Stein
Individual Reactions
By formula: Na+ + C5H10O5 = (Na+ • C5H10O5)
Quantity | Value | Units | Method | Reference | Comment |
---|---|---|---|---|---|
ΔrH° | 176. | kJ/mol | CIDC | Cerda and Wesdemiotis, 1999 | RCD |
Free energy of reaction
ΔrG° (kJ/mol) | T (K) | Method | Reference | Comment |
---|---|---|---|---|
0.0 | 298. | CIDC | Cerda and Wesdemiotis, 1999 | RCD |
By formula: C5H10O5 = C5H10O5
Quantity | Value | Units | Method | Reference | Comment |
---|---|---|---|---|---|
ΔrH° | -9.8 ± 3.0 | kJ/mol | Ciso | Tewari and Goldberg, 1985 | solid phase; solvent: Water; ALS |
By formula: C5H10O5 = C5H10O5
Quantity | Value | Units | Method | Reference | Comment |
---|---|---|---|---|---|
ΔrH° | 11.0 ± 1.5 | kJ/mol | Ciso | Tewari and Goldberg, 1985 | solid phase; solvent: Water; ALS |

Ion clustering data

Data compiled by: Robert C. Dunbar
Clustering reactions
By formula: Na+ + C5H10O5 = (Na+ • C5H10O5)
Quantity | Value | Units | Method | Reference | Comment |
---|---|---|---|---|---|
ΔrH° | 176. | kJ/mol | CIDC | Cerda and Wesdemiotis, 1999 |
Free energy of reaction
ΔrG° (kJ/mol) | T (K) | Method | Reference |
---|---|---|---|
0.0 | 298. | CIDC | Cerda and Wesdemiotis, 1999 |

References

Gubareva, Kunderenko, et al., 1991
Gubareva, A.; Kunderenko, V.M.; Gerasimov, P.A.,
Enthalpy of combustion and formation of d-ribose and d-ribono-γ-lactone,
Izv. Vyssh. Uchebn. Zaved., Khim. Khim. Tekhnol., 1991, 34, 41-45. [all data]
Colbert, Domalski, et al., 1987
Colbert, J.C.; Domalski, E.S.; Coxon, B.,
Enthalpies of combustion of d-ribose and 2-deoxy-d-ribose,
J. Chem. Thermodyn., 1987, 19, 433-441. [all data]
Desai and Wilhoit, 1970
Desai, P.; Wilhoit, R.C.,
Heats of combustion and enthalpies of formation of D-ribose, D-arabinose, and L-ascorbic acid,
Thermochim. Acta, 1970, 1, 61-64. [all data]
Stroh and Fincke, 1963
Stroh, H.H.; Fincke, C.R.,
Beobachtung ciner unterschidlichen hydrierbarkeit von n-substituiertten aziridin-derivaten,
Z. Chem., 1963, 3, 265-266. [all data]
Kawaizumi, Kushida, et al., 1981
Kawaizumi, F.; Kushida, S.; Miyahara, Y.,
Determination of the specific heat capacities of aqueous solutions of pentose,
Bull. Chem. Soc. Japan, 1981, 54(8), 2282-2285. [all data]
Cerda and Wesdemiotis, 1999
Cerda, B.A.; Wesdemiotis, C.,
Thermochemistry and Structures of Na+ Coordinated Mono- and Disaccharide Stereoisomers,
Int. J. Mass Spectrom., 1999, 189, 2-3, 189, https://doi.org/10.1016/S1387-3806(99)00085-8
. [all data]
Tewari and Goldberg, 1985
Tewari, Y.B.; Goldberg, R.N.,
An investigation of the equilibria between aqueous ribose, ribulose, and arabinose,
Biophys. Chem., 1985, 22, 197-204. [all data]