Eicosanoic acid
- Formula: C20H40O2
- Molecular weight: 312.5304
- IUPAC Standard InChIKey: VKOBVWXKNCXXDE-UHFFFAOYSA-N
- CAS Registry Number: 506-30-9
- Chemical structure:
View 3d structure (requires JavaScript / HTML 5) - Other names: Arachic acid; Arachidic acid; Icosanoic acid; n-Eicosanoic acid; Arachidic acid (synthetic)

Condensed phase thermochemistry data

Data compiled as indicated in comments:
ALS - Hussein Y. Afeefy, Joel F. Liebman, and Stephen E. Stein
DH - Eugene S. Domalski and Elizabeth D. Hearing
Quantity | Value | Units | Method | Reference | Comment |
---|---|---|---|---|---|
ΔcH°liquid | -12574.2 ± 1.5 | kJ/mol | Ccb | Adriaanse, Dekker, et al., 1965 | Hfusion=72.0 kJ/mol; Corresponding ΔfHºliquid = -1012.6 kJ/mol (simple calculation by NIST; no Washburn corrections); ALS |
Constant pressure heat capacity of solid
Cp,solid (J/mol*K) | Temperature (K) | Reference | Comment |
---|---|---|---|
545.14 | 298.15 | Schaake, van Miltenburg, et al., 1982 | T = 80 to 355 K.; DH |

Phase change data

Data compiled as indicated in comments:
TRC - Thermodynamics Research Center, NIST Boulder Laboratories, Chris Muzny director
AC - William E. Acree, Jr., James S. Chickos
ALS - Hussein Y. Afeefy, Joel F. Liebman, and Stephen E. Stein
DH - Eugene S. Domalski and Elizabeth D. Hearing
Quantity | Value | Units | Method | Reference | Comment |
---|---|---|---|---|---|
Tfus | 348.4 | K | N/A | Adriaanse, Dekker, et al., 1964 | Uncertainty assigned by TRC = 0.05 K; TRC |
Quantity | Value | Units | Method | Reference | Comment |
Ttriple | 348.23 | K | N/A | Schaake, van Miltenburg, et al., 1982, 2 | Uncertainty assigned by TRC = 0.02 K; TRC |
Ttriple | 347.25 | K | N/A | Spizzichino, 1956 | Uncertainty assigned by TRC = 0.6 K; TRC |
Quantity | Value | Units | Method | Reference | Comment |
Ptriple | 1.99983×10-8 | bar | N/A | Spizzichino, 1956 | Uncertainty assigned by TRC = 1.0666×10-8 bar; TRC |
Enthalpy of vaporization
ΔvapH (kJ/mol) | Temperature (K) | Method | Reference | Comment |
---|---|---|---|---|
114.5 | 492. | A | Stephenson and Malanowski, 1987 | Based on data from 477. to 670. K.; AC |
125.5 | 392. | ME,TE | de Kruif, Schaake, et al., 1982 | Based on data from 380. to 404. K.; AC |
Enthalpy of sublimation
ΔsubH (kJ/mol) | Temperature (K) | Method | Reference | Comment |
---|---|---|---|---|
148.4 | 305. to 323. | TPTD | Chattopadhyay and Ziemann, 2005 | Experimental values based on the TPTD method are often inconsistent with values determined using other experimental methods; AC |
199.6 ± 7.5 | 342. | ME | Davies and Malpass, 1961 | Based on data from 337. to 346. K. See also Cox and Pilcher, 1970.; AC |
200. ± 7.5 | 336.8 | V | Davies and Malpass, 1961, 2 | ALS |
Enthalpy of fusion
ΔfusH (kJ/mol) | Temperature (K) | Method | Reference | Comment |
---|---|---|---|---|
71.6 | 347.8 | DSC | Moreno, Cordobilla, et al., 2007 | AC |
69.2 | 348.2 | N/A | Domalski and Hearing, 1996 | AC |
Enthalpy of phase transition
ΔHtrs (kJ/mol) | Temperature (K) | Initial Phase | Final Phase | Reference | Comment |
---|---|---|---|---|---|
69.204 | 348.23 | crystaline, I | liquid | Schaake, van Miltenburg, et al., 1982 | DH |
Entropy of phase transition
ΔStrs (J/mol*K) | Temperature (K) | Initial Phase | Final Phase | Reference | Comment |
---|---|---|---|---|---|
198.7 | 348.23 | crystaline, I | liquid | Schaake, van Miltenburg, et al., 1982 | DH |

References

Adriaanse, Dekker, et al., 1965
Adriaanse, N.; Dekker, H.; Coops, J.,
Heats of combustion of normal saturated fatty acids and their methyl esters,
Rec. Trav. Chim. Pays/Bas, 1965, 84, 393-407. [all data]
Schaake, van Miltenburg, et al., 1982
Schaake, R.C.F.; van Miltenburg, J.C.; De Kruif, C.G.,
Thermodynamic properties of the normal alkanoic acids. II. Molar heat capacities of seven even-numbered normal alkanoic acids,
J. Chem. Thermodynam., 1982, 14, 771-778. [all data]
Adriaanse, Dekker, et al., 1964
Adriaanse, N.; Dekker, H.; Coops, J.,
Some Physical Constants of Normal, Saturated Fatty Acids and Their Methyl Esters,
Recl. Trav. Chim. Pays-Bas, 1964, 83, 557. [all data]
Schaake, van Miltenburg, et al., 1982, 2
Schaake, R.C.F.; van Miltenburg, J.C.; De Kruif, C.G.,
Thermodynamic properties of the normal alkanoic acids. II. Molar heat capacities of seven even-numbered normal alkanoic acids.,
J. Chem. Thermodyn., 1982, 14, 771-8. [all data]
Spizzichino, 1956
Spizzichino, C.,
Contribution a l'etude des tensions de vapeur et des chaleurs de vaporisation des acides gras, esters methyliques et alcools gras a des pressions inferieures a 1 mm de mercure,
J. des Recherches du C.N.R.S., 1956, 34, 1-24. [all data]
Stephenson and Malanowski, 1987
Stephenson, Richard M.; Malanowski, Stanislaw,
Handbook of the Thermodynamics of Organic Compounds, 1987, https://doi.org/10.1007/978-94-009-3173-2
. [all data]
de Kruif, Schaake, et al., 1982
de Kruif, C.G.; Schaake, R.C.F.; van Miltenburg, J.C.; van der Klauw, K.; Blok, J.G.,
Thermodynamic properties of the normal alkanoic acids III. Enthalpies of vaporization and vapour pressures of 13 normal alkanoic acids,
The Journal of Chemical Thermodynamics, 1982, 14, 8, 791-798, https://doi.org/10.1016/0021-9614(82)90176-8
. [all data]
Chattopadhyay and Ziemann, 2005
Chattopadhyay, Sulekha; Ziemann, Paul J.,
Vapor Pressures of Substituted and Unsubstituted Monocarboxylic and Dicarboxylic Acids Measured Using an Improved Thermal Desorption Particle Beam Mass Spectrometry Method,
Aerosol Science and Technology, 2005, 39, 11, 1085-1100, https://doi.org/10.1080/02786820500421547
. [all data]
Davies and Malpass, 1961
Davies, Mansel; Malpass, V.E.,
212. Heats of sublimation of straight-chain monocarboxylic acids,
J. Chem. Soc., 1961, 1048, https://doi.org/10.1039/jr9610001048
. [all data]
Cox and Pilcher, 1970
Cox, J.D.; Pilcher, G.,
Thermochemistry of Organic and Organometallic Compounds, Academic Press Inc., London, 1970, 643. [all data]
Davies and Malpass, 1961, 2
Davies, M.; Malpass, V.E.,
Heats of sublimation of straight-chain monocarboxylic acids,
J. Chem. Soc., 1961, 1048-10. [all data]
Moreno, Cordobilla, et al., 2007
Moreno, Evelyn; Cordobilla, Raquel; Calvet, Teresa; Cuevas-Diarte, M.A.; Gbabode, Gabin; Negrier, Philippe; Mondieig, Denise; Oonk, Harry A.J.,
Polymorphism of even saturated carboxylic acids from n-decanoic to n-eicosanoic acid,
New J. Chem., 2007, 31, 6, 947, https://doi.org/10.1039/b700551b
. [all data]
Domalski and Hearing, 1996
Domalski, Eugene S.; Hearing, Elizabeth D.,
Heat Capacities and Entropies of Organic Compounds in the Condensed Phase. Volume III,
J. Phys. Chem. Ref. Data, 1996, 25, 1, 1, https://doi.org/10.1063/1.555985
. [all data]