Linoelaidic acid
- Formula: C18H32O2
- Molecular weight: 280.4455
- IUPAC Standard InChIKey: OYHQOLUKZRVURQ-AVQMFFATSA-N
- CAS Registry Number: 506-21-8
- Chemical structure:
View 3d structure (requires JavaScript / HTML 5) - Stereoisomers:

Condensed phase thermochemistry data

Data compiled by: Hussein Y. Afeefy, Joel F. Liebman, and Stephen E. Stein
Quantity | Value | Units | Method | Reference | Comment |
---|---|---|---|---|---|
ΔfH°liquid | -640.2 | kJ/mol | Chyd | Rogers, Hoyte, et al., 1978 |

Phase change data

Data compiled by: William E. Acree, Jr., James S. Chickos
Enthalpy of fusion
ΔfusH (kJ/mol) | Temperature (K) | Method | Reference |
---|---|---|---|
47.7 | 303. | TA | Jalal, Zografi, et al., 1982 |

Reaction thermochemistry data

Data compiled by: Hussein Y. Afeefy, Joel F. Liebman, and Stephen E. Stein
Individual Reactions
By formula: 2H2 + C18H32O2 = C18H36O2
Quantity | Value | Units | Method | Reference | Comment |
---|---|---|---|---|---|
ΔrH° | -248.8 ± 0.5 | kJ/mol | Chyd | Rogers, Hoyte, et al., 1978 | liquid phase; solvent: Hexane |

References

Rogers, Hoyte, et al., 1978
Rogers, D.W.; Hoyte, O.P.A.; Ho, R.K.C.,
Heats of hydrogenation of large molecules. Part 2. Six unsaturated and polyunsaturated fatty acids,
J. Chem. Soc. Faraday Trans. 1, 1978, 74, 46-52. [all data]
Jalal, Zografi, et al., 1982
Jalal, I.M.; Zografi, G.; Rakshit, A.K.; Gunstone, F.D.,
Thermal analysis of fatty acids,
Chemistry and Physics of Lipids, 1982, 31, 4, 395-404, https://doi.org/10.1016/0009-3084(82)90074-3
. [all data]