11-Octadecenoic acid, (Z)-
- Formula: C18H34O2
- Molecular weight: 282.4614
- IUPAC Standard InChIKey: UWHZIFQPPBDJPM-FPLPWBNLSA-N
- CAS Registry Number: 506-17-2
- Chemical structure:

Phase change data

Data compiled as indicated in comments:
TRC - Thermodynamics Research Center, NIST Boulder Laboratories, Chris Muzny director
AC - William E. Acree, Jr., James S. Chickos
Quantity | Value | Units | Method | Reference | Comment |
---|---|---|---|---|---|
Tfus | 284.4 | K | N/A | Ahmad, Bumpus, et al., 1948 | Uncertainty assigned by TRC = 1. K; TRC |
Enthalpy of fusion
ΔfusH (kJ/mol) | Temperature (K) | Reference | Comment |
---|---|---|---|
39.8 | 287. | Sato, Yano, et al., 1997 | AC |

Van Den Dool and Kratz RI, non-polar column, custom temperature program

Column type | Active phase | I | Reference | Comment |
---|---|---|---|---|
Capillary | VF-5MS | 2116.6 | Tret'yakov, 2007 | 30. m/0.25 mm/0.25 μm, He; Program: Multi-step temperature program; T(initial)=60C; T(final)=270C |
Capillary | VF-5MS | 2161.8 | Tret'yakov, 2007 | 30. m/0.25 mm/0.25 μm, He; Program: Multi-step temperature program; T(initial)=60C; T(final)=270C |

References

Ahmad, Bumpus, et al., 1948
Ahmad, K.; Bumpus, F.M.; Strong, F.M.,
A Synthesis of cis-11-Octadecenoic and trans-11-Octadecenoic Acids,
J. Am. Chem. Soc., 1948, 70, 3391. [all data]
Sato, Yano, et al., 1997
Sato, K.; Yano, J.; Kawada, I.; Kawano, M.; Kaneko, F.; Suzuki, M.,
Polymorphic behavior of gondoic acid and phase behavior of its binary mixtures with asclepic acid and oleic acid,
J Amer Oil Chem Soc, 1997, 74, 9, 1153-1159, https://doi.org/10.1007/s11746-997-0039-7
. [all data]
Tret'yakov, 2007
Tret'yakov, K.V.,
Retention Data. NIST Mass Spectrometry Data Center., NIST Mass Spectrometry Data Center, 2007. [all data]