Heptadecanoic acid
- Formula: C17H34O2
- Molecular weight: 270.4507
- IUPAC Standard InChIKey: KEMQGTRYUADPNZ-UHFFFAOYSA-N
- CAS Registry Number: 506-12-7
- Chemical structure:
View 3d structure (requires JavaScript / HTML 5) - Other names: n-Heptadecanoic acid; n-Heptadecoic acid; n-Heptadecylic acid; Margaric acid; Margarinic acid; Normal-heptadecanoic acid

Condensed phase thermochemistry data

Data compiled as indicated in comments:
ALS - Hussein Y. Afeefy, Joel F. Liebman, and Stephen E. Stein
DH - Eugene S. Domalski and Elizabeth D. Hearing
Quantity | Value | Units | Method | Reference | Comment |
---|---|---|---|---|---|
ΔcH°liquid | -10624.4 ± 1.7 | kJ/mol | Ccb | Adriaanse, Dekker, et al., 1965 | Reanalyzed by Cox and Pilcher, 1970, Original value = -10623.6 ± 1.7 kJ/mol; Hfusion=58.8 kJ/mol; Corresponding ΔfHºliquid = -924.4 kJ/mol (simple calculation by NIST; no Washburn corrections); ALS |
Constant pressure heat capacity of solid
Cp,solid (J/mol*K) | Temperature (K) | Reference | Comment |
---|---|---|---|
475.74 | 298.15 | Schaake, van Miltenburg, et al., 1982 | T = 80 to 350 K.; DH |

Phase change data

Data compiled as indicated in comments:
BS - Robert L. Brown and Stephen E. Stein
TRC - Thermodynamics Research Center, NIST Boulder Laboratories, Chris Muzny director
AC - William E. Acree, Jr., James S. Chickos
CAL - James S. Chickos, William E. Acree, Jr., Joel F. Liebman, Students of Chem 202 (Introduction to the Literature of Chemistry), University of Missouri -- St. Louis
DH - Eugene S. Domalski and Elizabeth D. Hearing
Quantity | Value | Units | Method | Reference | Comment |
---|---|---|---|---|---|
Tfus | 332. ± 7. | K | AVG | N/A | Average of 8 values; Individual data points |
Quantity | Value | Units | Method | Reference | Comment |
Ttriple | 334.25 | K | N/A | Schaake, van Miltenburg, et al., 1982, 2 | Crystal phase 1 phase; Uncertainty assigned by TRC = 0.02 K; TRC |
Quantity | Value | Units | Method | Reference | Comment |
Tc | 795.08 | K | N/A | D'Souza and Teja, 1987 | Uncertainty assigned by TRC = 3. K; Ambrose's procedure; TRC |
Quantity | Value | Units | Method | Reference | Comment |
Pc | 13.939 | bar | N/A | D'Souza and Teja, 1987 | Uncertainty assigned by TRC = 0.85 bar; Ambrose's procedure; TRC |
Reduced pressure boiling point
Tboil (K) | Pressure (bar) | Reference | Comment |
---|---|---|---|
500.2 | 0.133 | Weast and Grasselli, 1989 | BS |
Enthalpy of vaporization
ΔvapH (kJ/mol) | Temperature (K) | Method | Reference | Comment |
---|---|---|---|---|
100.7 | 464. | A | Stephenson and Malanowski, 1987 | Based on data from 449. to 637. K.; AC |
112.7 ± 2.0 | 372. | ME,TE | de Kruif, Schaake, et al., 1982 | Based on data from 357. to 382. K.; AC |
Enthalpy of sublimation
ΔsubH (kJ/mol) | Temperature (K) | Method | Reference | Comment |
---|---|---|---|---|
151. | 280. to 302. | TPTD | Chattopadhyay and Ziemann, 2005 | AC |
168. | 291. to 316. | TPTD | Chattopadhyay, Tobias, et al., 2001 | Experimental values based on the TPTD method are often inconsistent with values determined using other experimental methods; AC |
Enthalpy of fusion
ΔfusH (kJ/mol) | Temperature (K) | Method | Reference | Comment |
---|---|---|---|---|
46.5 | 333.5 | DSC | Gbabode, Negrier, et al., 2007 | See also Gbabode, Negrier, et al., 2008.; AC |
51.33 | 334.3 | N/A | Domalski and Hearing, 1996 | AC |
51.9 | 333. | N/A | Berchiesi, Bercuiesi, et al., 1976 | AC |
Entropy of fusion
ΔfusS (J/mol*K) | Temperature (K) | Reference | Comment |
---|---|---|---|
22.59 | 329.2 | Domalski and Hearing, 1996 | CAL |
153.55 | 334.3 |
Enthalpy of phase transition
ΔHtrs (kJ/mol) | Temperature (K) | Initial Phase | Final Phase | Reference | Comment |
---|---|---|---|---|---|
7.435 | 329.2 | crystaline, II | crystaline, I | Schaake, van Miltenburg, et al., 1982 | DH |
51.342 | 334.25 | crystaline, I | liquid | Schaake, van Miltenburg, et al., 1982 | DH |
Entropy of phase transition
ΔStrs (J/mol*K) | Temperature (K) | Initial Phase | Final Phase | Reference | Comment |
---|---|---|---|---|---|
22.59 | 329.2 | crystaline, II | crystaline, I | Schaake, van Miltenburg, et al., 1982 | DH |
153.60 | 334.25 | crystaline, I | liquid | Schaake, van Miltenburg, et al., 1982 | DH |

References

Adriaanse, Dekker, et al., 1965
Adriaanse, N.; Dekker, H.; Coops, J.,
Heats of combustion of normal saturated fatty acids and their methyl esters,
Rec. Trav. Chim. Pays/Bas, 1965, 84, 393-407. [all data]
Cox and Pilcher, 1970
Cox, J.D.; Pilcher, G.,
Thermochemistry of Organic and Organometallic Compounds, Academic Press, New York, 1970, 1-636. [all data]
Schaake, van Miltenburg, et al., 1982
Schaake, R.C.F.; van Miltenburg, J.C.; De Kruif, C.G.,
Thermodynamic properties of the normal alkanoic acids. I. Molar heat capacities of seven odd-numbered normal alkanoic acids,
J. Chem. Thermodynam., 1982, 14, 763-769. [all data]
Schaake, van Miltenburg, et al., 1982, 2
Schaake, R.C.F.; van Miltenburg, J.C.; De Kruif, C.G.,
Thermodynamic properties of the normal alkanoic acids. I. Molar heat capacities of seven odd-numbered normal alkanoic acids.,
J. Chem. Thermodyn., 1982, 14, 763. [all data]
D'Souza and Teja, 1987
D'Souza, R.; Teja, A.S.,
The prediction of the vapor pressures of carboxylic acids,
Chem. Eng. Commun., 1987, 61, 13. [all data]
Weast and Grasselli, 1989
CRC Handbook of Data on Organic Compounds, 2nd Editon, Weast,R.C and Grasselli, J.G., ed(s)., CRC Press, Inc., Boca Raton, FL, 1989, 1. [all data]
Stephenson and Malanowski, 1987
Stephenson, Richard M.; Malanowski, Stanislaw,
Handbook of the Thermodynamics of Organic Compounds, 1987, https://doi.org/10.1007/978-94-009-3173-2
. [all data]
de Kruif, Schaake, et al., 1982
de Kruif, C.G.; Schaake, R.C.F.; van Miltenburg, J.C.; van der Klauw, K.; Blok, J.G.,
Thermodynamic properties of the normal alkanoic acids III. Enthalpies of vaporization and vapour pressures of 13 normal alkanoic acids,
The Journal of Chemical Thermodynamics, 1982, 14, 8, 791-798, https://doi.org/10.1016/0021-9614(82)90176-8
. [all data]
Chattopadhyay and Ziemann, 2005
Chattopadhyay, Sulekha; Ziemann, Paul J.,
Vapor Pressures of Substituted and Unsubstituted Monocarboxylic and Dicarboxylic Acids Measured Using an Improved Thermal Desorption Particle Beam Mass Spectrometry Method,
Aerosol Science and Technology, 2005, 39, 11, 1085-1100, https://doi.org/10.1080/02786820500421547
. [all data]
Chattopadhyay, Tobias, et al., 2001
Chattopadhyay, Sulekha; Tobias, Herbert J.; Ziemann, Paul J.,
A Method for Measuring Vapor Pressures of Low-Volatility Organic Aerosol Compounds Using a Thermal Desorption Particle Beam Mass Spectrometer,
Anal. Chem., 2001, 73, 16, 3797-3803, https://doi.org/10.1021/ac010304j
. [all data]
Gbabode, Negrier, et al., 2007
Gbabode, Gabin; Negrier, Philippe; Mondieig, Denise; Moreno Calvo, Evelyn; Calvet, Teresa; Cuevas-Diarte, Miquel Àngel,
Structures of the High-Temperature Solid Phases of the Odd-Numbered Fatty Acids from Tridecanoic Acid to Tricosanoic Acid,
Chem. Eur. J., 2007, 13, 11, 3150-3159, https://doi.org/10.1002/chem.200600955
. [all data]
Gbabode, Negrier, et al., 2008
Gbabode, Gabin; Negrier, Philippe; Mondieig, Denise; Moreno, Evelyn; Calvet, Teresa; Cuevas-Diarte, Miquel Àngel,
Polymorphism and solid-state miscibility in the pentadecanoic acid--heptadecanoic acid binary system,
Chemistry and Physics of Lipids, 2008, 154, 1, 68-77, https://doi.org/10.1016/j.chemphyslip.2008.04.008
. [all data]
Domalski and Hearing, 1996
Domalski, Eugene S.; Hearing, Elizabeth D.,
Heat Capacities and Entropies of Organic Compounds in the Condensed Phase. Volume III,
J. Phys. Chem. Ref. Data, 1996, 25, 1, 1, https://doi.org/10.1063/1.555985
. [all data]
Berchiesi, Bercuiesi, et al., 1976
Berchiesi, G.; Bercuiesi, M.A.; Lobbia, G.G.; Leonesi, D.,
Gazz. Chim. Ital., 1976, 106, 549. [all data]