2(3H)-Furanone, 3-bromodihydro-
- Formula: C4H5BrO2
- Molecular weight: 164.985
- IUPAC Standard InChIKey: LFJJGHGXHXXDFT-UHFFFAOYSA-N
- CAS Registry Number: 5061-21-2
- Chemical structure:
View 3d structure (requires JavaScript / HTML 5) - Other names: α-Bromo-γ-butyrolactone; 2-Bromo-4-butyrolactone; 2-Bromo-γ-butyrolactone; α-Bromobutyric acid, γ-lactone; α-Bromobutyrolactone; 2-Bromo-4-butanolide; 2-Bromobutyrolactone; 3-Bromodihydro-2-furanone; 3-Bromodihydro-2(3H)-furanone; Butyric acid, 2-bromo-4-hydroxy-, gamma-lactone; 3-Bromo-2-oxotetrahydrofuran; NSC 56959

Phase change data

Data compiled by: Robert L. Brown and Stephen E. Stein
Reduced pressure boiling point
Tboil (K) | Pressure (bar) | Reference |
---|---|---|
411.2 | 0.008 | Aldrich Chemical Company Inc., 1990 |
369. to 370. | 0.007 | Buckingham and Donaghy, 1982 |

References

Aldrich Chemical Company Inc., 1990
Aldrich Chemical Company Inc.,
Catalog Handbook of Fine Chemicals, Aldrich Chemical Company, Inc., Milwaukee WI, 1990, 1. [all data]
Buckingham and Donaghy, 1982
Buckingham, J.; Donaghy, S.M.,
Dictionary of Organic Compounds: Fifth Edition, Chapman and Hall, New York, 1982, 1. [all data]