4(3H)-Quinazolinone, 3-(4-hydroxy-2-methylphenyl)-2-methyl-
- Formula: C16H14N2O2
- Molecular weight: 266.2946
- IUPAC Standard InChIKey: HIYZKXXSRNPSQJ-UHFFFAOYSA-N
- CAS Registry Number: 5060-52-6
- Chemical structure:
View 3d structure (requires JavaScript / HTML 5) - Other names: 4(3H)-Quinazolinone, 3-(4-hydroxy-o-tolyl)-2-methyl-; 4'-Hydroxymethaqualone; 3-(4-Hydroxy-2-methylphenyl)-2-methyl-4(3H)-quinazolinone; 2-Methyl-3-(4-hydroxy-2-methylphenyl)-3,4-dihydroquinazolin-4-one; Methaqualone M (4'-OH)

Kovats' RI, non-polar column, temperature ramp

Column type | Active phase | I | Reference | Comment |
---|---|---|---|---|
Packed | SE-30 | 2530. | Maurer, 1990 | N2, 100. C @ 3. min, 30. K/min, 310. C @ 5. min |

References

Maurer, 1990
Maurer, H.H.,
Identification and differentiation of barbiturates, other sedative-hypnotics and their metabolites in urine integrated in a general screening procedure using computerized gas chromatography-mass spectrometry,
J. Chromatogr., 1990, 530, 307-326, https://doi.org/10.1016/S0378-4347(00)82334-8
. [all data]